/* -*- mode: c++; c-basic-offset: 2; indent-tabs-mode: nil; -*-
 *  vim:expandtab:shiftwidth=2:tabstop=2:smarttab:
 *
 * drizzle-interface: Interface Wrappers for Drizzle
 * Copyright (c) 2009 Sun Microsystems
 * Copyright (c) 2010 Monty Taylor and Max Goodman
 * All rights reserved.
 *
 * Redistribution and use in source and binary forms, with or without
 * modification, are permitted provided that the following conditions are met:
 *
 * 1. Redistributions of source code must retain the above copyright
 *    notice, this list of conditions and the following disclaimer.
 * 2. Redistributions in binary form must reproduce the above copyright
 *    notice, this list of conditions and the following disclaimer in the
 *    documentation and/or other materials provided with the distribution.
 * 3. The name of the author may not be used to endorse or promote products
 *    derived from this software without specific prior written permission.
 *
 * THIS SOFTWARE IS PROVIDED BY THE COPYRIGHT HOLDERS AND CONTRIBUTORS
 * "AS IS" AND ANY EXPRESS OR IMPLIED WARRANTIES, INCLUDING, BUT NOT
 * LIMITED TO, THE IMPLIED WARRANTIES OF MERCHANTABILITY AND FITNESS FOR
 * A PARTICULAR PURPOSE ARE DISCLAIMED. IN NO EVENT SHALL THE COPYRIGHT OWNER OR
 * CONTRIBUTORS BE LIABLE FOR ANY DIRECT, INDIRECT, INCIDENTAL, SPECIAL,
 * EXEMPLARY, OR CONSEQUENTIAL DAMAGES (INCLUDING, BUT NOT LIMITED TO,
 * PROCUREMENT OF SUBSTITUTE GOODS OR SERVICES; LOSS OF USE, DATA, OR
 * PROFITS; OR BUSINESS INTERRUPTION) HOWEVER CAUSED AND ON ANY THEORY OF
 * LIABILITY, WHETHER IN CONTRACT, STRICT LIABILITY, OR TORT (INCLUDING
 * NEGLIGENCE OR OTHERWISE) ARISING IN ANY WAY OUT OF THE USE OF THIS
 * SOFTWARE, EVEN IF ADVISED OF THE POSSIBILITY OF SUCH DAMAGE.
 */


%module libdrizzle
%include "typemaps.i"


%include "interface/globals.i"

%include "interface/python/drizzle_exception.i"
%include "interface/python/query_string.i"
%include "interface/python/field_buffered.i"
%include "interface/python/drizzle_row_t.i"
%include "interface/python/value_return.i"
%include "interface/python/row_buffered.i"
%include "interface/python/unicode.i"

%include "interface/libdrizzle/drizzle.i"
%include "interface/libdrizzle/connection.i"
%include "interface/libdrizzle/query.i"
%include "interface/libdrizzle/result.i"
%include "interface/libdrizzle/column.i"

%include "interface/python/buffer_multiple.i"
