PWD /home/nikratio/in-progress/s3ql/doc/pdf
INPUT /var/lib/texmf/web2c/luahbtex/lualatex.fmt
INPUT ./manual.tex
OUTPUT manual.log
INPUT /usr/share/texlive/texmf-dist/tex/latex/latexconfig/lualatexquotejobname.lua
INPUT /usr/share/texlive/texmf-dist/tex/latex/base/ltluatex.lua
INPUT /usr/share/texlive/texmf-dist/tex/latex/l3kernel/expl3.lua
INPUT ./sphinxmanual.cls
INPUT ./sphinxmanual.cls
INPUT ./sphinxmanual.cls
INPUT /usr/share/texlive/texmf-dist/tex/latex/base/report.cls
INPUT /usr/share/texlive/texmf-dist/tex/latex/base/report.cls
INPUT /usr/share/texlive/texmf-dist/tex/latex/base/report.cls
INPUT /usr/share/texlive/texmf-dist/tex/latex/base/size10.clo
INPUT /usr/share/texlive/texmf-dist/tex/latex/base/size10.clo
INPUT /usr/share/texlive/texmf-dist/fonts/tfm/public/cm/cmr10.tfm
INPUT /usr/share/texlive/texmf-dist/tex/latex/base/inputenc.sty
INPUT /usr/share/texlive/texmf-dist/tex/latex/base/inputenc.sty
INPUT /usr/share/texlive/texmf-dist/tex/latex/base/inputenc.sty
INPUT /usr/share/texlive/texmf-dist/tex/latex/cmap/cmap.sty
INPUT /usr/share/texlive/texmf-dist/tex/latex/cmap/cmap.sty
INPUT /usr/share/texlive/texmf-dist/tex/latex/cmap/cmap.sty
INPUT /usr/share/texlive/texmf-dist/tex/latex/base/fontenc.sty
INPUT /usr/share/texlive/texmf-dist/tex/latex/base/fontenc.sty
INPUT /usr/share/texlive/texmf-dist/tex/latex/base/fontenc.sty
INPUT /usr/share/texlive/texmf-dist/fonts/tfm/jknappen/ec/ecrm1000.tfm
INPUT /usr/share/texlive/texmf-dist/tex/latex/cmap/t1.cmap
OUTPUT manual.pdf
INPUT /usr/share/texlive/texmf-dist/tex/latex/cmap/t1.cmap
INPUT /usr/share/texlive/texmf-dist/tex/latex/amsmath/amsmath.sty
INPUT /usr/share/texlive/texmf-dist/tex/latex/amsmath/amsmath.sty
INPUT /usr/share/texlive/texmf-dist/tex/latex/amsmath/amsmath.sty
INPUT /usr/share/texlive/texmf-dist/tex/latex/amsmath/amstext.sty
INPUT /usr/share/texlive/texmf-dist/tex/latex/amsmath/amstext.sty
INPUT /usr/share/texlive/texmf-dist/tex/latex/amsmath/amstext.sty
INPUT /usr/share/texlive/texmf-dist/tex/latex/amsmath/amsgen.sty
INPUT /usr/share/texlive/texmf-dist/tex/latex/amsmath/amsgen.sty
INPUT /usr/share/texlive/texmf-dist/tex/latex/amsmath/amsgen.sty
INPUT /usr/share/texlive/texmf-dist/tex/latex/amsmath/amsbsy.sty
INPUT /usr/share/texlive/texmf-dist/tex/latex/amsmath/amsbsy.sty
INPUT /usr/share/texlive/texmf-dist/tex/latex/amsmath/amsbsy.sty
INPUT /usr/share/texlive/texmf-dist/tex/latex/amsmath/amsopn.sty
INPUT /usr/share/texlive/texmf-dist/tex/latex/amsmath/amsopn.sty
INPUT /usr/share/texlive/texmf-dist/tex/latex/amsmath/amsopn.sty
INPUT /usr/share/texlive/texmf-dist/tex/latex/amsfonts/amssymb.sty
INPUT /usr/share/texlive/texmf-dist/tex/latex/amsfonts/amssymb.sty
INPUT /usr/share/texlive/texmf-dist/tex/latex/amsfonts/amssymb.sty
INPUT /usr/share/texlive/texmf-dist/tex/latex/amsfonts/amsfonts.sty
INPUT /usr/share/texlive/texmf-dist/tex/latex/amsfonts/amsfonts.sty
INPUT /usr/share/texlive/texmf-dist/tex/latex/amsfonts/amsfonts.sty
INPUT /usr/share/texlive/texmf-dist/tex/generic/babel/babel.sty
INPUT /usr/share/texlive/texmf-dist/tex/generic/babel/babel.sty
INPUT /usr/share/texlive/texmf-dist/tex/generic/babel/babel.sty
INPUT /usr/share/texlive/texmf-dist/tex/generic/babel/luababel.def
INPUT /var/lib/texmf/tex/generic/config/language.dat
INPUT /usr/share/texlive/texmf-dist/tex/generic/babel/luababel.def
INPUT /usr/share/texlive/texmf-dist/tex/generic/babel-english/english.ldf
INPUT /usr/share/texlive/texmf-dist/tex/generic/babel-english/english.ldf
INPUT /usr/share/texlive/texmf-dist/tex/generic/babel-english/english.ldf
INPUT /usr/share/texlive/texmf-dist/tex/generic/babel/locale/en/babel-english.tex
INPUT /usr/share/texlive/texmf-dist/tex/generic/babel/locale/en/babel-english.tex
INPUT /usr/share/texlive/texmf-dist/tex/generic/babel/locale/en/babel-en.ini
INPUT /usr/share/texmf/tex/latex/tex-gyre/tgtermes.sty
INPUT /usr/share/texmf/tex/latex/tex-gyre/tgtermes.sty
INPUT /usr/share/texmf/tex/latex/tex-gyre/tgtermes.sty
INPUT /usr/share/texlive/texmf-dist/tex/latex/kvoptions/kvoptions.sty
INPUT /usr/share/texlive/texmf-dist/tex/latex/kvoptions/kvoptions.sty
INPUT /usr/share/texlive/texmf-dist/tex/latex/kvoptions/kvoptions.sty
INPUT /usr/share/texlive/texmf-dist/tex/latex/graphics/keyval.sty
INPUT /usr/share/texlive/texmf-dist/tex/latex/graphics/keyval.sty
INPUT /usr/share/texlive/texmf-dist/tex/latex/graphics/keyval.sty
INPUT /usr/share/texlive/texmf-dist/tex/generic/ltxcmds/ltxcmds.sty
INPUT /usr/share/texlive/texmf-dist/tex/generic/ltxcmds/ltxcmds.sty
INPUT /usr/share/texlive/texmf-dist/tex/generic/ltxcmds/ltxcmds.sty
INPUT /usr/share/texlive/texmf-dist/tex/latex/kvsetkeys/kvsetkeys.sty
INPUT /usr/share/texlive/texmf-dist/tex/latex/kvsetkeys/kvsetkeys.sty
INPUT /usr/share/texlive/texmf-dist/tex/latex/kvsetkeys/kvsetkeys.sty
INPUT /usr/share/texmf/tex/latex/tex-gyre/tgheros.sty
INPUT /usr/share/texmf/tex/latex/tex-gyre/tgheros.sty
INPUT /usr/share/texmf/tex/latex/tex-gyre/tgheros.sty
INPUT /usr/share/texlive/texmf-dist/tex/latex/fncychap/fncychap.sty
INPUT /usr/share/texlive/texmf-dist/tex/latex/fncychap/fncychap.sty
INPUT /usr/share/texlive/texmf-dist/tex/latex/fncychap/fncychap.sty
INPUT ./sphinx.sty
INPUT ./sphinx.sty
INPUT ./sphinx.sty
INPUT /usr/share/texlive/texmf-dist/tex/latex/xcolor/xcolor.sty
INPUT /usr/share/texlive/texmf-dist/tex/latex/xcolor/xcolor.sty
INPUT /usr/share/texlive/texmf-dist/tex/latex/xcolor/xcolor.sty
INPUT /usr/share/texlive/texmf-dist/tex/latex/xcolor/xcolor.sty
INPUT /usr/share/texlive/texmf-dist/tex/latex/graphics-cfg/color.cfg
INPUT /usr/share/texlive/texmf-dist/tex/latex/graphics-cfg/color.cfg
INPUT /usr/share/texlive/texmf-dist/tex/latex/graphics-def/luatex.def
INPUT /usr/share/texlive/texmf-dist/tex/latex/graphics-def/luatex.def
INPUT /usr/share/texlive/texmf-dist/tex/latex/graphics/mathcolor.ltx
INPUT /usr/share/texlive/texmf-dist/tex/latex/graphics/mathcolor.ltx
INPUT ./sphinxoptionshyperref.sty
INPUT ./sphinxoptionshyperref.sty
INPUT ./sphinxoptionsgeometry.sty
INPUT ./sphinxoptionsgeometry.sty
INPUT /usr/share/texlive/texmf-dist/tex/latex/base/textcomp.sty
INPUT /usr/share/texlive/texmf-dist/tex/latex/base/textcomp.sty
INPUT /usr/share/texlive/texmf-dist/tex/latex/base/textcomp.sty
INPUT /usr/share/texlive/texmf-dist/tex/latex/float/float.sty
INPUT /usr/share/texlive/texmf-dist/tex/latex/float/float.sty
INPUT /usr/share/texlive/texmf-dist/tex/latex/float/float.sty
INPUT /usr/share/texlive/texmf-dist/tex/latex/wrapfig/wrapfig.sty
INPUT /usr/share/texlive/texmf-dist/tex/latex/wrapfig/wrapfig.sty
INPUT /usr/share/texlive/texmf-dist/tex/latex/wrapfig/wrapfig.sty
INPUT /usr/share/texlive/texmf-dist/tex/latex/capt-of/capt-of.sty
INPUT /usr/share/texlive/texmf-dist/tex/latex/capt-of/capt-of.sty
INPUT /usr/share/texlive/texmf-dist/tex/latex/capt-of/capt-of.sty
INPUT /usr/share/texlive/texmf-dist/tex/latex/tools/multicol.sty
INPUT /usr/share/texlive/texmf-dist/tex/latex/tools/multicol.sty
INPUT /usr/share/texlive/texmf-dist/tex/latex/tools/multicol.sty
INPUT /usr/share/texlive/texmf-dist/tex/latex/graphics/graphicx.sty
INPUT /usr/share/texlive/texmf-dist/tex/latex/graphics/graphicx.sty
INPUT /usr/share/texlive/texmf-dist/tex/latex/graphics/graphicx.sty
INPUT /usr/share/texlive/texmf-dist/tex/latex/graphics/graphics.sty
INPUT /usr/share/texlive/texmf-dist/tex/latex/graphics/graphics.sty
INPUT /usr/share/texlive/texmf-dist/tex/latex/graphics/graphics.sty
INPUT /usr/share/texlive/texmf-dist/tex/latex/graphics/trig.sty
INPUT /usr/share/texlive/texmf-dist/tex/latex/graphics/trig.sty
INPUT /usr/share/texlive/texmf-dist/tex/latex/graphics/trig.sty
INPUT /usr/share/texlive/texmf-dist/tex/latex/graphics-cfg/graphics.cfg
INPUT /usr/share/texlive/texmf-dist/tex/latex/graphics-cfg/graphics.cfg
INPUT ./sphinxlatexgraphics.sty
INPUT ./sphinxlatexgraphics.sty
INPUT ./sphinxpackageboxes.sty
INPUT ./sphinxpackageboxes.sty
INPUT ./sphinxpackageboxes.sty
INPUT ./sphinxlatexadmonitions.sty
INPUT ./sphinxlatexadmonitions.sty
INPUT /usr/share/texlive/texmf-dist/tex/latex/framed/framed.sty
INPUT /usr/share/texlive/texmf-dist/tex/latex/framed/framed.sty
INPUT /usr/share/texlive/texmf-dist/tex/latex/framed/framed.sty
INPUT ./sphinxlatexliterals.sty
INPUT ./sphinxlatexliterals.sty
INPUT /usr/share/texlive/texmf-dist/tex/latex/fancyvrb/fancyvrb.sty
INPUT /usr/share/texlive/texmf-dist/tex/latex/fancyvrb/fancyvrb.sty
INPUT /usr/share/texlive/texmf-dist/tex/latex/fancyvrb/fancyvrb.sty
INPUT /usr/share/texlive/texmf-dist/tex/latex/base/alltt.sty
INPUT /usr/share/texlive/texmf-dist/tex/latex/base/alltt.sty
INPUT /usr/share/texlive/texmf-dist/tex/latex/base/alltt.sty
INPUT /usr/share/texlive/texmf-dist/tex/latex/upquote/upquote.sty
INPUT /usr/share/texlive/texmf-dist/tex/latex/upquote/upquote.sty
INPUT /usr/share/texlive/texmf-dist/tex/latex/upquote/upquote.sty
INPUT /usr/share/texlive/texmf-dist/tex/latex/needspace/needspace.sty
INPUT /usr/share/texlive/texmf-dist/tex/latex/needspace/needspace.sty
INPUT /usr/share/texlive/texmf-dist/tex/latex/needspace/needspace.sty
INPUT ./sphinxlatexshadowbox.sty
INPUT ./sphinxlatexshadowbox.sty
INPUT ./sphinxlatexcontainers.sty
INPUT ./sphinxlatexcontainers.sty
INPUT ./sphinxhighlight.sty
INPUT ./sphinxhighlight.sty
INPUT ./sphinxhighlight.sty
INPUT ./sphinxlatextables.sty
INPUT ./sphinxlatextables.sty
INPUT /usr/share/texlive/texmf-dist/tex/latex/tabulary/tabulary.sty
INPUT /usr/share/texlive/texmf-dist/tex/latex/tabulary/tabulary.sty
INPUT /usr/share/texlive/texmf-dist/tex/latex/tabulary/tabulary.sty
INPUT /usr/share/texlive/texmf-dist/tex/latex/tools/array.sty
INPUT /usr/share/texlive/texmf-dist/tex/latex/tools/array.sty
INPUT /usr/share/texlive/texmf-dist/tex/latex/tools/array.sty
INPUT /usr/share/texlive/texmf-dist/tex/latex/tools/longtable.sty
INPUT /usr/share/texlive/texmf-dist/tex/latex/tools/longtable.sty
INPUT /usr/share/texlive/texmf-dist/tex/latex/tools/longtable.sty
INPUT /usr/share/texlive/texmf-dist/tex/latex/varwidth/varwidth.sty
INPUT /usr/share/texlive/texmf-dist/tex/latex/varwidth/varwidth.sty
INPUT /usr/share/texlive/texmf-dist/tex/latex/varwidth/varwidth.sty
INPUT /usr/share/texlive/texmf-dist/tex/latex/colortbl/colortbl.sty
INPUT /usr/share/texlive/texmf-dist/tex/latex/colortbl/colortbl.sty
INPUT /usr/share/texlive/texmf-dist/tex/latex/colortbl/colortbl.sty
INPUT ./sphinxlatexnumfig.sty
INPUT ./sphinxlatexnumfig.sty
INPUT ./sphinxlatexlists.sty
INPUT ./sphinxlatexlists.sty
INPUT ./sphinxpackagefootnote.sty
INPUT ./sphinxpackagefootnote.sty
INPUT ./sphinxpackagefootnote.sty
INPUT ./sphinxlatexindbibtoc.sty
INPUT ./sphinxlatexindbibtoc.sty
INPUT /usr/share/texlive/texmf-dist/tex/latex/base/makeidx.sty
INPUT /usr/share/texlive/texmf-dist/tex/latex/base/makeidx.sty
INPUT /usr/share/texlive/texmf-dist/tex/latex/base/makeidx.sty
INPUT ./sphinxlatexstylepage.sty
INPUT ./sphinxlatexstylepage.sty
INPUT /usr/share/texlive/texmf-dist/tex/latex/parskip/parskip-2001-04-09.sty
INPUT /usr/share/texlive/texmf-dist/tex/latex/parskip/parskip.sty
INPUT /usr/share/texlive/texmf-dist/tex/latex/parskip/parskip.sty
INPUT /usr/share/texlive/texmf-dist/tex/latex/parskip/parskip.sty
INPUT /usr/share/texlive/texmf-dist/tex/latex/parskip/parskip-2001-04-09.sty
INPUT /usr/share/texlive/texmf-dist/tex/latex/fancyhdr/fancyhdr.sty
INPUT /usr/share/texlive/texmf-dist/tex/latex/fancyhdr/fancyhdr.sty
INPUT /usr/share/texlive/texmf-dist/tex/latex/fancyhdr/fancyhdr.sty
INPUT ./sphinxlatexstyleheadings.sty
INPUT ./sphinxlatexstyleheadings.sty
INPUT /usr/share/texlive/texmf-dist/tex/latex/titlesec/titlesec.sty
INPUT /usr/share/texlive/texmf-dist/tex/latex/titlesec/titlesec.sty
INPUT /usr/share/texlive/texmf-dist/tex/latex/titlesec/titlesec.sty
INPUT ./sphinxlatexstyletext.sty
INPUT ./sphinxlatexstyletext.sty
INPUT ./sphinxlatexobjects.sty
INPUT ./sphinxlatexobjects.sty
INPUT /usr/share/texlive/texmf-dist/tex/latex/geometry/geometry.sty
INPUT /usr/share/texlive/texmf-dist/tex/latex/geometry/geometry.sty
INPUT /usr/share/texlive/texmf-dist/tex/latex/geometry/geometry.sty
INPUT /usr/share/texlive/texmf-dist/tex/generic/iftex/ifvtex.sty
INPUT /usr/share/texlive/texmf-dist/tex/generic/iftex/ifvtex.sty
INPUT /usr/share/texlive/texmf-dist/tex/generic/iftex/ifvtex.sty
INPUT /usr/share/texlive/texmf-dist/tex/generic/iftex/iftex.sty
INPUT /usr/share/texlive/texmf-dist/tex/generic/iftex/iftex.sty
INPUT /usr/share/texlive/texmf-dist/tex/generic/iftex/iftex.sty
INPUT /usr/share/texlive/texmf-dist/tex/latex/hyperref/hyperref.sty
INPUT /usr/share/texlive/texmf-dist/tex/latex/hyperref/hyperref.sty
INPUT /usr/share/texlive/texmf-dist/tex/latex/hyperref/hyperref.sty
INPUT /usr/share/texlive/texmf-dist/tex/generic/pdftexcmds/pdftexcmds.sty
INPUT /usr/share/texlive/texmf-dist/tex/generic/pdftexcmds/pdftexcmds.sty
INPUT /usr/share/texlive/texmf-dist/tex/generic/pdftexcmds/pdftexcmds.sty
INPUT /usr/share/texlive/texmf-dist/tex/generic/infwarerr/infwarerr.sty
INPUT /usr/share/texlive/texmf-dist/tex/generic/infwarerr/infwarerr.sty
INPUT /usr/share/texlive/texmf-dist/tex/generic/infwarerr/infwarerr.sty
INPUT /usr/share/texlive/texmf-dist/tex/generic/pdftexcmds/pdftexcmds.lua
INPUT /usr/share/texlive/texmf-dist/tex/generic/kvdefinekeys/kvdefinekeys.sty
INPUT /usr/share/texlive/texmf-dist/tex/generic/kvdefinekeys/kvdefinekeys.sty
INPUT /usr/share/texlive/texmf-dist/tex/generic/kvdefinekeys/kvdefinekeys.sty
INPUT /usr/share/texlive/texmf-dist/tex/generic/pdfescape/pdfescape.sty
INPUT /usr/share/texlive/texmf-dist/tex/generic/pdfescape/pdfescape.sty
INPUT /usr/share/texlive/texmf-dist/tex/generic/pdfescape/pdfescape.sty
INPUT /usr/share/texlive/texmf-dist/tex/latex/hycolor/hycolor.sty
INPUT /usr/share/texlive/texmf-dist/tex/latex/hycolor/hycolor.sty
INPUT /usr/share/texlive/texmf-dist/tex/latex/hycolor/hycolor.sty
INPUT /usr/share/texlive/texmf-dist/tex/latex/letltxmacro/letltxmacro.sty
INPUT /usr/share/texlive/texmf-dist/tex/latex/letltxmacro/letltxmacro.sty
INPUT /usr/share/texlive/texmf-dist/tex/latex/letltxmacro/letltxmacro.sty
INPUT /usr/share/texlive/texmf-dist/tex/latex/auxhook/auxhook.sty
INPUT /usr/share/texlive/texmf-dist/tex/latex/auxhook/auxhook.sty
INPUT /usr/share/texlive/texmf-dist/tex/latex/auxhook/auxhook.sty
INPUT /usr/share/texlive/texmf-dist/tex/latex/hyperref/nameref.sty
INPUT /usr/share/texlive/texmf-dist/tex/latex/hyperref/nameref.sty
INPUT /usr/share/texlive/texmf-dist/tex/latex/hyperref/nameref.sty
INPUT /usr/share/texlive/texmf-dist/tex/latex/refcount/refcount.sty
INPUT /usr/share/texlive/texmf-dist/tex/latex/refcount/refcount.sty
INPUT /usr/share/texlive/texmf-dist/tex/latex/refcount/refcount.sty
INPUT /usr/share/texlive/texmf-dist/tex/generic/gettitlestring/gettitlestring.sty
INPUT /usr/share/texlive/texmf-dist/tex/generic/gettitlestring/gettitlestring.sty
INPUT /usr/share/texlive/texmf-dist/tex/generic/gettitlestring/gettitlestring.sty
INPUT /usr/share/texlive/texmf-dist/tex/latex/hyperref/pd1enc.def
INPUT /usr/share/texlive/texmf-dist/tex/latex/hyperref/pd1enc.def
INPUT /usr/share/texlive/texmf-dist/tex/generic/intcalc/intcalc.sty
INPUT /usr/share/texlive/texmf-dist/tex/generic/intcalc/intcalc.sty
INPUT /usr/share/texlive/texmf-dist/tex/generic/intcalc/intcalc.sty
INPUT /usr/share/texlive/texmf-dist/tex/generic/etexcmds/etexcmds.sty
INPUT /usr/share/texlive/texmf-dist/tex/generic/etexcmds/etexcmds.sty
INPUT /usr/share/texlive/texmf-dist/tex/generic/etexcmds/etexcmds.sty
INPUT /usr/share/texlive/texmf-dist/tex/latex/hyperref/puenc.def
INPUT /usr/share/texlive/texmf-dist/tex/latex/hyperref/puenc.def
INPUT /usr/share/texlive/texmf-dist/tex/latex/url/url.sty
INPUT /usr/share/texlive/texmf-dist/tex/latex/url/url.sty
INPUT /usr/share/texlive/texmf-dist/tex/latex/url/url.sty
INPUT /usr/share/texlive/texmf-dist/tex/generic/bitset/bitset.sty
INPUT /usr/share/texlive/texmf-dist/tex/generic/bitset/bitset.sty
INPUT /usr/share/texlive/texmf-dist/tex/generic/bitset/bitset.sty
INPUT /usr/share/texlive/texmf-dist/tex/generic/bigintcalc/bigintcalc.sty
INPUT /usr/share/texlive/texmf-dist/tex/generic/bigintcalc/bigintcalc.sty
INPUT /usr/share/texlive/texmf-dist/tex/generic/bigintcalc/bigintcalc.sty
INPUT /usr/share/texlive/texmf-dist/tex/latex/base/atbegshi-ltx.sty
INPUT /usr/share/texlive/texmf-dist/tex/latex/base/atbegshi-ltx.sty
INPUT /usr/share/texlive/texmf-dist/tex/latex/base/atbegshi-ltx.sty
INPUT /usr/share/texlive/texmf-dist/tex/latex/hyperref/hluatex.def
INPUT /usr/share/texlive/texmf-dist/tex/latex/hyperref/hluatex.def
INPUT /usr/share/texlive/texmf-dist/tex/generic/stringenc/stringenc.sty
INPUT /usr/share/texlive/texmf-dist/tex/generic/stringenc/stringenc.sty
INPUT /usr/share/texlive/texmf-dist/tex/generic/stringenc/stringenc.sty
INPUT /usr/share/texlive/texmf-dist/tex/latex/base/atveryend-ltx.sty
INPUT /usr/share/texlive/texmf-dist/tex/latex/base/atveryend-ltx.sty
INPUT /usr/share/texlive/texmf-dist/tex/latex/base/atveryend-ltx.sty
INPUT /usr/share/texlive/texmf-dist/tex/latex/rerunfilecheck/rerunfilecheck.sty
INPUT /usr/share/texlive/texmf-dist/tex/latex/rerunfilecheck/rerunfilecheck.sty
INPUT /usr/share/texlive/texmf-dist/tex/latex/rerunfilecheck/rerunfilecheck.sty
INPUT /usr/share/texlive/texmf-dist/tex/generic/uniquecounter/uniquecounter.sty
INPUT /usr/share/texlive/texmf-dist/tex/generic/uniquecounter/uniquecounter.sty
INPUT /usr/share/texlive/texmf-dist/tex/generic/uniquecounter/uniquecounter.sty
INPUT /usr/share/texlive/texmf-dist/tex/latex/oberdiek/hypcap.sty
INPUT /usr/share/texlive/texmf-dist/tex/latex/oberdiek/hypcap.sty
INPUT /usr/share/texlive/texmf-dist/tex/latex/oberdiek/hypcap.sty
INPUT ./sphinxmessages.sty
INPUT ./sphinxmessages.sty
INPUT ./sphinxmessages.sty
OUTPUT manual.idx
INPUT /usr/share/texmf/tex/latex/tex-gyre/t1qtm.fd
INPUT /usr/share/texmf/tex/latex/tex-gyre/t1qtm.fd
INPUT /usr/share/texmf/fonts/tfm/public/tex-gyre/ec-qtmr.tfm
INPUT /usr/share/texlive/texmf-dist/tex/latex/l3backend/l3backend-luatex.def
INPUT /usr/share/texlive/texmf-dist/tex/latex/l3backend/l3backend-luatex.def
INPUT /usr/share/texlive/texmf-dist/tex/latex/l3backend/l3backend-luatex.def
INPUT ./manual.aux
INPUT ./manual.aux
OUTPUT manual.aux
INPUT /usr/share/texlive/texmf-dist/tex/latex/base/ts1cmr.fd
INPUT /usr/share/texlive/texmf-dist/tex/latex/base/ts1cmr.fd
INPUT /usr/share/texlive/texmf-dist/tex/context/base/mkii/supp-pdf.mkii
INPUT /usr/share/texlive/texmf-dist/tex/context/base/mkii/supp-pdf.mkii
INPUT /usr/share/texlive/texmf-dist/tex/latex/epstopdf-pkg/epstopdf-base.sty
INPUT /usr/share/texlive/texmf-dist/tex/latex/epstopdf-pkg/epstopdf-base.sty
INPUT /usr/share/texlive/texmf-dist/tex/latex/epstopdf-pkg/epstopdf-base.sty
INPUT /usr/share/texlive/texmf-dist/tex/latex/latexconfig/epstopdf-sys.cfg
INPUT /usr/share/texlive/texmf-dist/tex/latex/latexconfig/epstopdf-sys.cfg
INPUT ./manual.out
INPUT ./manual.out
INPUT ./manual.out
INPUT ./manual.out
INPUT ./manual.out
OUTPUT manual.out
INPUT /usr/share/texmf/tex/latex/tex-gyre/t1qhv.fd
INPUT /usr/share/texmf/tex/latex/tex-gyre/t1qhv.fd
INPUT /usr/share/texmf/fonts/tfm/public/tex-gyre/ec-qhvr.tfm
INPUT /usr/share/texmf/fonts/tfm/public/tex-gyre/ec-qhvb.tfm
INPUT /usr/share/texmf/fonts/tfm/public/tex-gyre/ec-qhvb.tfm
INPUT /usr/share/texmf/fonts/tfm/public/tex-gyre/ec-qhvbi.tfm
INPUT /usr/share/texmf/fonts/tfm/public/tex-gyre/ec-qhvbi.tfm
INPUT /usr/share/texmf/fonts/tfm/public/tex-gyre/ec-qhvb.tfm
INPUT /usr/share/texlive/texmf-dist/fonts/tfm/public/cm/cmr17.tfm
INPUT /usr/share/texlive/texmf-dist/tex/latex/cmap/ot1.cmap
INPUT /usr/share/texlive/texmf-dist/tex/latex/cmap/ot1.cmap
INPUT /usr/share/texlive/texmf-dist/fonts/tfm/public/cm/cmr12.tfm
INPUT /usr/share/texlive/texmf-dist/fonts/tfm/public/cm/cmmi12.tfm
INPUT /usr/share/texlive/texmf-dist/tex/latex/mmap/oml.cmap
INPUT /usr/share/texlive/texmf-dist/tex/latex/mmap/oml.cmap
INPUT /usr/share/texlive/texmf-dist/fonts/tfm/public/cm/cmmi12.tfm
INPUT /usr/share/texlive/texmf-dist/fonts/tfm/public/cm/cmmi10.tfm
INPUT /usr/share/texlive/texmf-dist/fonts/tfm/public/cm/cmsy10.tfm
INPUT /usr/share/texlive/texmf-dist/tex/latex/mmap/oms.cmap
INPUT /usr/share/texlive/texmf-dist/tex/latex/mmap/oms.cmap
INPUT /usr/share/texlive/texmf-dist/fonts/tfm/public/cm/cmsy10.tfm
INPUT /usr/share/texlive/texmf-dist/fonts/tfm/public/cm/cmsy10.tfm
INPUT /usr/share/texlive/texmf-dist/fonts/tfm/public/cm/cmex10.tfm
INPUT /usr/share/texlive/texmf-dist/tex/latex/mmap/omx.cmap
INPUT /usr/share/texlive/texmf-dist/tex/latex/mmap/omx.cmap
INPUT /usr/share/texlive/texmf-dist/fonts/tfm/public/cm/cmex10.tfm
INPUT /usr/share/texlive/texmf-dist/fonts/tfm/public/cm/cmex10.tfm
INPUT /usr/share/texlive/texmf-dist/tex/latex/amsfonts/umsa.fd
INPUT /usr/share/texlive/texmf-dist/tex/latex/amsfonts/umsa.fd
INPUT /usr/share/texlive/texmf-dist/fonts/tfm/public/amsfonts/symbols/msam10.tfm
INPUT /usr/share/texlive/texmf-dist/fonts/tfm/public/amsfonts/symbols/msam10.tfm
INPUT /usr/share/texlive/texmf-dist/fonts/tfm/public/amsfonts/symbols/msam10.tfm
INPUT /usr/share/texlive/texmf-dist/tex/latex/amsfonts/umsb.fd
INPUT /usr/share/texlive/texmf-dist/tex/latex/amsfonts/umsb.fd
INPUT /usr/share/texlive/texmf-dist/fonts/tfm/public/amsfonts/symbols/msbm10.tfm
INPUT /usr/share/texlive/texmf-dist/fonts/tfm/public/amsfonts/symbols/msbm10.tfm
INPUT /usr/share/texlive/texmf-dist/fonts/tfm/public/amsfonts/symbols/msbm10.tfm
INPUT /usr/share/texmf/fonts/tfm/public/tex-gyre/ec-qhvb.tfm
INPUT /home/nikratio/.texlive2022/texmf-var/fonts/map/pdftex/updmap/pdftex.map
INPUT /usr/share/texmf/fonts/tfm/public/tex-gyre/ec-qtmr.tfm
INPUT /usr/share/texmf/fonts/tfm/public/tex-gyre/ec-qhvr.tfm
INPUT /usr/share/texmf/fonts/tfm/public/tex-gyre/ec-qhvb.tfm
INPUT ./manual.toc
INPUT ./manual.toc
INPUT /usr/share/texmf/fonts/tfm/public/tex-gyre/ec-qtmb.tfm
INPUT /usr/share/texlive/texmf-dist/fonts/tfm/public/cm/cmr7.tfm
INPUT /usr/share/texlive/texmf-dist/fonts/tfm/public/cm/cmr5.tfm
INPUT /usr/share/texlive/texmf-dist/fonts/tfm/public/cm/cmmi7.tfm
INPUT /usr/share/texlive/texmf-dist/fonts/tfm/public/cm/cmmi5.tfm
INPUT /usr/share/texlive/texmf-dist/fonts/tfm/public/cm/cmsy7.tfm
INPUT /usr/share/texlive/texmf-dist/fonts/tfm/public/cm/cmsy5.tfm
INPUT /usr/share/texlive/texmf-dist/fonts/tfm/public/amsfonts/cmextra/cmex7.tfm
INPUT /usr/share/texlive/texmf-dist/fonts/tfm/public/amsfonts/cmextra/cmex7.tfm
INPUT /usr/share/texlive/texmf-dist/fonts/tfm/public/amsfonts/symbols/msam7.tfm
INPUT /usr/share/texlive/texmf-dist/fonts/tfm/public/amsfonts/symbols/msam5.tfm
INPUT /usr/share/texlive/texmf-dist/fonts/tfm/public/amsfonts/symbols/msbm7.tfm
INPUT /usr/share/texlive/texmf-dist/fonts/tfm/public/amsfonts/symbols/msbm5.tfm
INPUT /usr/share/texlive/texmf-dist/tex/latex/txfonts/t1txtt.fd
INPUT /usr/share/texlive/texmf-dist/tex/latex/txfonts/t1txtt.fd
INPUT /usr/share/texlive/texmf-dist/fonts/tfm/public/txfonts/t1xtt.tfm
INPUT /usr/share/texlive/texmf-dist/fonts/tfm/public/txfonts/t1xbtt.tfm
INPUT /usr/share/texlive/texmf-dist/fonts/tfm/public/txfonts/t1xbtt.tfm
OUTPUT manual.toc
INPUT /usr/share/texmf/tex/latex/tex-gyre/ts1qtm.fd
INPUT /usr/share/texmf/tex/latex/tex-gyre/ts1qtm.fd
INPUT /usr/share/texmf/fonts/tfm/public/tex-gyre/ts1-qtmr.tfm
INPUT /usr/share/texmf/fonts/tfm/public/tex-gyre/ec-qtmri.tfm
INPUT /usr/share/texlive/texmf-dist/tex/latex/txfonts/ts1txtt.fd
INPUT /usr/share/texlive/texmf-dist/tex/latex/txfonts/ts1txtt.fd
INPUT /usr/share/texlive/texmf-dist/fonts/tfm/public/txfonts/tcxtt.tfm
INPUT /usr/share/texlive/texmf-dist/fonts/tfm/public/txfonts/t1xttsl.tfm
INPUT /usr/share/texlive/texmf-dist/fonts/tfm/public/txfonts/t1xttsl.tfm
INPUT /usr/share/texlive/texmf-dist/fonts/tfm/public/txfonts/t1xtt.tfm
INPUT /usr/share/texmf/fonts/tfm/public/tex-gyre/ec-qtmr.tfm
INPUT /usr/share/texmf/fonts/tfm/public/tex-gyre/ec-qhvr.tfm
INPUT /usr/share/texmf/fonts/tfm/public/tex-gyre/ec-qtmr.tfm
INPUT /usr/share/texlive/texmf-dist/fonts/tfm/public/txfonts/t1xbtt.tfm
INPUT /usr/share/texlive/texmf-dist/fonts/tfm/public/txfonts/t1xbtt.tfm
INPUT ./manual.ind
INPUT ./manual.ind
INPUT ./manual.aux
INPUT ./manual.out
INPUT /usr/share/texmf/fonts/type1/public/tex-gyre/qhvb.pfb
INPUT /usr/share/texmf/fonts/type1/public/tex-gyre/qhvbi.pfb
INPUT /usr/share/texmf/fonts/type1/public/tex-gyre/qhvr.pfb
INPUT /usr/share/texmf/fonts/type1/public/tex-gyre/qtmb.pfb
INPUT /usr/share/texmf/fonts/type1/public/tex-gyre/qtmr.pfb
INPUT /usr/share/texmf/fonts/type1/public/tex-gyre/qtmri.pfb
INPUT /usr/share/texlive/texmf-dist/fonts/type1/public/txfonts/t1xbtt.pfb
INPUT /usr/share/texlive/texmf-dist/fonts/type1/public/txfonts/t1xtt.pfb
INPUT /usr/share/texlive/texmf-dist/fonts/type1/public/txfonts/tcxtt.pfb
