<?xml version="1.0" encoding="UTF-8" standalone="no"?>
<!-- Created with Inkscape (http://www.inkscape.org/) -->
<svg
   xmlns:dc="http://purl.org/dc/elements/1.1/"
   xmlns:cc="http://web.resource.org/cc/"
   xmlns:rdf="http://www.w3.org/1999/02/22-rdf-syntax-ns#"
   xmlns:svg="http://www.w3.org/2000/svg"
   xmlns="http://www.w3.org/2000/svg"
   xmlns:xlink="http://www.w3.org/1999/xlink"
   xmlns:sodipodi="http://sodipodi.sourceforge.net/DTD/sodipodi-0.dtd"
   xmlns:inkscape="http://www.inkscape.org/namespaces/inkscape"
   width="180"
   height="6"
   id="svg2"
   sodipodi:version="0.32"
   inkscape:version="0.45.1"
   version="1.0"
   sodipodi:docbase="/usr/local/share/screenlets/Disk/themes/cristal"
   sodipodi:docname="disk-gauge.svg"
   inkscape:output_extension="org.inkscape.output.svg.inkscape">
  <defs
     id="defs4">
    <linearGradient
       id="linearGradient5137">
      <stop
         style="stop-color:#87c2ea;stop-opacity:1;"
         offset="0"
         id="stop5139" />
      <stop
         style="stop-color:#0081ff;stop-opacity:1;"
         offset="1"
         id="stop5141" />
    </linearGradient>
    <linearGradient
       id="linearGradient6178">
      <stop
         style="stop-color:#0000ff;stop-opacity:1;"
         offset="0"
         id="stop6180" />
      <stop
         style="stop-color:#0000ff;stop-opacity:0.67346936;"
         offset="1"
         id="stop6182" />
    </linearGradient>
    <linearGradient
       id="linearGradient4220">
      <stop
         style="stop-color:#0000ff;stop-opacity:1;"
         offset="0"
         id="stop4222" />
      <stop
         style="stop-color:#1200ff;stop-opacity:0.78571427;"
         offset="1"
         id="stop4224" />
    </linearGradient>
    <linearGradient
       id="linearGradient4262">
      <stop
         style="stop-color:#ffffff;stop-opacity:0;"
         offset="0"
         id="stop4264" />
      <stop
         style="stop-color:#ffffff;stop-opacity:0.47272727;"
         offset="1"
         id="stop4266" />
    </linearGradient>
    <linearGradient
       id="linearGradient4146">
      <stop
         id="stop4148"
         offset="0"
         style="stop-color:#ffffff;stop-opacity:1;" />
      <stop
         id="stop4150"
         offset="1"
         style="stop-color:#ffffff;stop-opacity:0;" />
    </linearGradient>
    <linearGradient
       id="linearGradient4137">
      <stop
         id="stop4139"
         offset="0"
         style="stop-color:#22e62f;stop-opacity:0;" />
      <stop
         id="stop4141"
         offset="1"
         style="stop-color:#000000;stop-opacity:0.62272727;" />
    </linearGradient>
    <linearGradient
       id="linearGradient4114">
      <stop
         style="stop-color:#22e62f;stop-opacity:1;"
         offset="0"
         id="stop4116" />
      <stop
         style="stop-color:#22e62f;stop-opacity:0;"
         offset="1"
         id="stop4118" />
    </linearGradient>
    <linearGradient
       inkscape:collect="always"
       xlink:href="#linearGradient4114"
       id="linearGradient4128"
       gradientUnits="userSpaceOnUse"
       x1="21.67046"
       y1="19.404301"
       x2="425.15463"
       y2="197.20781" />
    <radialGradient
       inkscape:collect="always"
       xlink:href="#linearGradient4137"
       id="radialGradient4135"
       cx="202.50002"
       cy="97.857147"
       fx="202.50002"
       fy="97.857147"
       r="180.3712"
       gradientTransform="matrix(1,0,0,0.4356876,0,55.222007)"
       gradientUnits="userSpaceOnUse" />
    <linearGradient
       inkscape:collect="always"
       xlink:href="#linearGradient4146"
       id="linearGradient4152"
       gradientUnits="userSpaceOnUse"
       x1="202.5"
       y1="19.271662"
       x2="202.5"
       y2="176.44264" />
    <linearGradient
       inkscape:collect="always"
       xlink:href="#linearGradient4262"
       id="linearGradient4268"
       x1="455.79065"
       y1="39.440891"
       x2="472.27121"
       y2="39.440891"
       gradientUnits="userSpaceOnUse" />
    <linearGradient
       inkscape:collect="always"
       xlink:href="#linearGradient4262"
       id="linearGradient4270"
       x1="430.854"
       y1="39.440891"
       x2="447.33456"
       y2="39.440891"
       gradientUnits="userSpaceOnUse" />
    <linearGradient
       inkscape:collect="always"
       xlink:href="#linearGradient4262"
       id="linearGradient4272"
       x1="405.9173"
       y1="39.440891"
       x2="422.39789"
       y2="39.440891"
       gradientUnits="userSpaceOnUse" />
    <linearGradient
       inkscape:collect="always"
       xlink:href="#linearGradient4262"
       id="linearGradient4274"
       x1="380.98065"
       y1="39.440891"
       x2="397.46121"
       y2="39.440891"
       gradientUnits="userSpaceOnUse" />
    <linearGradient
       inkscape:collect="always"
       xlink:href="#linearGradient4262"
       id="linearGradient4276"
       x1="356.04398"
       y1="39.440891"
       x2="372.52457"
       y2="39.440891"
       gradientUnits="userSpaceOnUse" />
    <linearGradient
       inkscape:collect="always"
       xlink:href="#linearGradient4262"
       id="linearGradient4278"
       x1="331.10733"
       y1="39.440891"
       x2="347.58789"
       y2="39.440891"
       gradientUnits="userSpaceOnUse" />
    <linearGradient
       inkscape:collect="always"
       xlink:href="#linearGradient4262"
       id="linearGradient4280"
       x1="306.17065"
       y1="39.440891"
       x2="322.65121"
       y2="39.440891"
       gradientUnits="userSpaceOnUse" />
    <linearGradient
       inkscape:collect="always"
       xlink:href="#linearGradient4262"
       id="linearGradient4282"
       x1="281.23398"
       y1="39.440891"
       x2="297.71457"
       y2="39.440891"
       gradientUnits="userSpaceOnUse" />
    <linearGradient
       inkscape:collect="always"
       xlink:href="#linearGradient4262"
       id="linearGradient4284"
       x1="256.29733"
       y1="39.440891"
       x2="272.77789"
       y2="39.440891"
       gradientUnits="userSpaceOnUse" />
    <linearGradient
       inkscape:collect="always"
       xlink:href="#linearGradient4262"
       id="linearGradient4286"
       x1="231.36066"
       y1="39.440891"
       x2="247.84125"
       y2="39.440891"
       gradientUnits="userSpaceOnUse" />
    <linearGradient
       inkscape:collect="always"
       xlink:href="#linearGradient4262"
       id="linearGradient4288"
       x1="206.424"
       y1="39.440891"
       x2="222.90457"
       y2="39.440891"
       gradientUnits="userSpaceOnUse" />
    <linearGradient
       inkscape:collect="always"
       xlink:href="#linearGradient4262"
       id="linearGradient4290"
       x1="181.48734"
       y1="39.440891"
       x2="197.96791"
       y2="39.440891"
       gradientUnits="userSpaceOnUse" />
    <linearGradient
       inkscape:collect="always"
       xlink:href="#linearGradient4262"
       id="linearGradient4292"
       x1="156.55066"
       y1="39.440891"
       x2="173.03123"
       y2="39.440891"
       gradientUnits="userSpaceOnUse" />
    <linearGradient
       inkscape:collect="always"
       xlink:href="#linearGradient4262"
       id="linearGradient4294"
       x1="131.614"
       y1="39.440891"
       x2="148.09457"
       y2="39.440891"
       gradientUnits="userSpaceOnUse" />
    <linearGradient
       inkscape:collect="always"
       xlink:href="#linearGradient4262"
       id="linearGradient4296"
       x1="106.67734"
       y1="39.440891"
       x2="123.15792"
       y2="39.440891"
       gradientUnits="userSpaceOnUse" />
    <linearGradient
       inkscape:collect="always"
       xlink:href="#linearGradient4262"
       id="linearGradient4298"
       x1="81.740669"
       y1="39.440891"
       x2="98.221245"
       y2="39.440891"
       gradientUnits="userSpaceOnUse" />
    <linearGradient
       inkscape:collect="always"
       xlink:href="#linearGradient4262"
       id="linearGradient4300"
       x1="56.804008"
       y1="39.440891"
       x2="73.284584"
       y2="39.440891"
       gradientUnits="userSpaceOnUse" />
    <linearGradient
       inkscape:collect="always"
       xlink:href="#linearGradient4262"
       id="linearGradient4302"
       x1="31.86734"
       y1="39.440891"
       x2="48.347919"
       y2="39.440891"
       gradientUnits="userSpaceOnUse" />
    <linearGradient
       inkscape:collect="always"
       xlink:href="#linearGradient4262"
       id="linearGradient4304"
       x1="6.9306765"
       y1="39.440891"
       x2="23.411255"
       y2="39.440891"
       gradientUnits="userSpaceOnUse" />
  </defs>
  <sodipodi:namedview
     id="base"
     pagecolor="#ffffff"
     bordercolor="#666666"
     borderopacity="1.0"
     inkscape:pageopacity="0.0"
     inkscape:pageshadow="2"
     inkscape:zoom="4"
     inkscape:cx="122.58301"
     inkscape:cy="3.5349837"
     inkscape:document-units="px"
     inkscape:current-layer="layer4"
     width="180px"
     height="6px"
     inkscape:window-width="896"
     inkscape:window-height="632"
     inkscape:window-x="112"
     inkscape:window-y="360" />
  <metadata
     id="metadata7">
    <rdf:RDF>
      <cc:Work
         rdf:about="">
        <dc:format>image/svg+xml</dc:format>
        <dc:type
           rdf:resource="http://purl.org/dc/dcmitype/StillImage" />
      </cc:Work>
    </rdf:RDF>
  </metadata>
  <g
     inkscape:groupmode="layer"
     id="layer4"
     inkscape:label="logo"
     style="display:inline">
    <rect
       style="fill:#d40000;fill-opacity:1;fill-rule:evenodd;stroke:none;stroke-width:0.741;stroke-linecap:butt;stroke-linejoin:miter;stroke-miterlimit:4;stroke-dasharray:none;stroke-opacity:1"
       id="rect2211"
       width="190"
       height="6"
       x="0"
       y="0" />
  </g>
</svg>
