<?xml version="1.0" encoding="UTF-8" standalone="no"?>
<!-- Created with Inkscape (http://www.inkscape.org/) -->
<svg
   xmlns:dc="http://purl.org/dc/elements/1.1/"
   xmlns:cc="http://web.resource.org/cc/"
   xmlns:rdf="http://www.w3.org/1999/02/22-rdf-syntax-ns#"
   xmlns:svg="http://www.w3.org/2000/svg"
   xmlns="http://www.w3.org/2000/svg"
   xmlns:xlink="http://www.w3.org/1999/xlink"
   xmlns:sodipodi="http://sodipodi.sourceforge.net/DTD/sodipodi-0.dtd"
   xmlns:inkscape="http://www.inkscape.org/namespaces/inkscape"
   width="140"
   height="20"
   id="svg2"
   inkscape:label="Pozadí"
   sodipodi:version="0.32"
   inkscape:version="0.45.1"
   version="1.0"
   sodipodi:docname="field.svg"
   sodipodi:docbase="/home/helder/.screenlets/TorrentSearch/themes/default"
   inkscape:output_extension="org.inkscape.output.svg.inkscape">
  <sodipodi:namedview
     id="base"
     pagecolor="#ffffff"
     bordercolor="#666666"
     borderopacity="1.0"
     inkscape:pageopacity="0.0"
     inkscape:pageshadow="2"
     inkscape:zoom="3.4600001"
     inkscape:cx="118.66727"
     inkscape:cy="43.195222"
     inkscape:document-units="px"
     inkscape:current-layer="layer1"
     width="140px"
     height="20px"
     inkscape:grid-points="true"
     showgrid="true"
     inkscape:window-width="910"
     inkscape:window-height="626"
     inkscape:window-x="357"
     inkscape:window-y="106"
     gridtolerance="10000" />
  <defs
     id="defs2201">
    <linearGradient
       id="linearGradient5815">
      <stop
         offset="0"
         id="stop5817"
         style="stop-color:#343434;stop-opacity:0;" />
      <stop
         offset="1"
         id="stop5819"
         style="stop-color:#343434;stop-opacity:0.50196081;" />
    </linearGradient>
    <linearGradient
       inkscape:collect="always"
       id="linearGradient3464"
       x1="54.989429"
       y1="49.971497"
       gradientTransform="matrix(1,0,0,0.5,0,-15)"
       x2="50"
       gradientUnits="userSpaceOnUse"
       xlink:href="#linearGradient5815"
       y2="50" />
    <linearGradient
       inkscape:collect="always"
       id="linearGradient3466"
       x1="60.020229"
       y1="40"
       gradientTransform="matrix(3.7142858,0,0,1,-149.28572,-35)"
       x2="60.020229"
       gradientUnits="userSpaceOnUse"
       xlink:href="#linearGradient5815"
       y2="34.992195" />
    <linearGradient
       inkscape:collect="always"
       id="linearGradient4461"
       x1="184.9711"
       y1="5.0578051"
       x2="185"
       gradientUnits="userSpaceOnUse"
       xlink:href="#linearGradient5815"
       y2="0" />
    <linearGradient
       inkscape:collect="always"
       id="linearGradient4473"
       x1="44.653179"
       y1="33.670521"
       x2="40"
       gradientUnits="userSpaceOnUse"
       xlink:href="#linearGradient5815"
       y2="33.670521" />
    <radialGradient
       inkscape:collect="always"
       id="radialGradient4485"
       r="2.5"
       gradientTransform="matrix(-1.1627176e-2,-1.98854,1.9768786,-1.1559749e-2,-23.66887,124.74471)"
       cx="44.942196"
       cy="34.9711"
       gradientUnits="userSpaceOnUse"
       xlink:href="#linearGradient5815"
       fy="34.9711"
       fx="44.942196" />
    <linearGradient
       inkscape:collect="always"
       id="linearGradient3464-286"
       y2="50"
       y1="49.971497"
       gradientTransform="matrix(1,0,0,0.5,0,-15)"
       x2="50"
       gradientUnits="userSpaceOnUse"
       xlink:href="#linearGradient5815-177"
       x1="54.989429" />
    <linearGradient
       id="linearGradient5815-177">
      <stop
         offset="0"
         id="stop2184"
         style="stop-color:#2f2f2f;stop-opacity:0;" />
      <stop
         offset="1"
         id="stop2186"
         style="stop-color:#2f2f2f;stop-opacity:0.50196081;" />
    </linearGradient>
    <linearGradient
       inkscape:collect="always"
       id="linearGradient3466-863"
       y2="34.992195"
       y1="40"
       gradientTransform="matrix(3.7142858,0,0,1,-149.28572,-35)"
       x2="60.020229"
       gradientUnits="userSpaceOnUse"
       xlink:href="#linearGradient5815-455"
       x1="60.020229" />
    <linearGradient
       id="linearGradient5815-455">
      <stop
         offset="0"
         id="stop2190"
         style="stop-color:#2f2f2f;stop-opacity:0;" />
      <stop
         offset="1"
         id="stop2192"
         style="stop-color:#2f2f2f;stop-opacity:0.50196081;" />
    </linearGradient>
    <linearGradient
       inkscape:collect="always"
       id="linearGradient4461-549"
       y2="0"
       y1="5.0578051"
       x2="185"
       gradientUnits="userSpaceOnUse"
       xlink:href="#linearGradient5815-8"
       x1="184.9711" />
    <linearGradient
       id="linearGradient5815-8">
      <stop
         offset="0"
         id="stop2196"
         style="stop-color:#2f2f2f;stop-opacity:0;" />
      <stop
         offset="1"
         id="stop2198"
         style="stop-color:#2f2f2f;stop-opacity:0.50196081;" />
    </linearGradient>
    <linearGradient
       inkscape:collect="always"
       id="linearGradient4473-942"
       y2="33.670521"
       y1="33.670521"
       x2="40"
       gradientUnits="userSpaceOnUse"
       xlink:href="#linearGradient5815-297"
       x1="44.653179" />
    <linearGradient
       id="linearGradient5815-297">
      <stop
         offset="0"
         id="stop2202"
         style="stop-color:#2f2f2f;stop-opacity:0;" />
      <stop
         offset="1"
         id="stop2204"
         style="stop-color:#2f2f2f;stop-opacity:0.50196081;" />
    </linearGradient>
    <radialGradient
       inkscape:collect="always"
       id="radialGradient4485-581"
       r="2.5"
       gradientTransform="matrix(-1.1627176e-2,-1.98854,1.9768786,-1.1559749e-2,-23.66887,124.74471)"
       cx="44.942196"
       cy="34.9711"
       gradientUnits="userSpaceOnUse"
       xlink:href="#linearGradient5815-27"
       fy="34.9711"
       fx="44.942196" />
    <linearGradient
       id="linearGradient5815-27">
      <stop
         offset="0"
         id="stop2208"
         style="stop-color:#2f2f2f;stop-opacity:0;" />
      <stop
         offset="1"
         id="stop2210"
         style="stop-color:#2f2f2f;stop-opacity:0.50196081;" />
    </linearGradient>
    <linearGradient
       inkscape:collect="always"
       id="linearGradient3464-286-860"
       x1="54.989429"
       y1="49.971497"
       gradientTransform="matrix(1,0,0,0.5,0,-15)"
       x2="50"
       gradientUnits="userSpaceOnUse"
       xlink:href="#linearGradient5815-177-763"
       y2="50" />
    <linearGradient
       id="linearGradient5815-177-763">
      <stop
         offset="0"
         id="stop2293"
         style="stop-color:#2a2a2a;stop-opacity:0;" />
      <stop
         offset="1"
         id="stop2295"
         style="stop-color:#2a2a2a;stop-opacity:0.50196081;" />
    </linearGradient>
    <linearGradient
       inkscape:collect="always"
       id="linearGradient3466-863-789"
       x1="60.020229"
       y1="40"
       gradientTransform="matrix(3.7142858,0,0,1,-149.28572,-35)"
       x2="60.020229"
       gradientUnits="userSpaceOnUse"
       xlink:href="#linearGradient5815-455-798"
       y2="34.992195" />
    <linearGradient
       id="linearGradient5815-455-798">
      <stop
         offset="0"
         id="stop2299"
         style="stop-color:#2a2a2a;stop-opacity:0;" />
      <stop
         offset="1"
         id="stop2301"
         style="stop-color:#2a2a2a;stop-opacity:0.50196081;" />
    </linearGradient>
    <linearGradient
       inkscape:collect="always"
       id="linearGradient4461-549-258"
       x1="184.9711"
       y1="5.0578051"
       x2="185"
       gradientUnits="userSpaceOnUse"
       xlink:href="#linearGradient5815-8-516"
       y2="0" />
    <linearGradient
       id="linearGradient5815-8-516">
      <stop
         offset="0"
         id="stop2305"
         style="stop-color:#2a2a2a;stop-opacity:0;" />
      <stop
         offset="1"
         id="stop2307"
         style="stop-color:#2a2a2a;stop-opacity:0.50196081;" />
    </linearGradient>
    <linearGradient
       inkscape:collect="always"
       id="linearGradient4473-942-956"
       x1="44.653179"
       y1="33.670521"
       x2="40"
       gradientUnits="userSpaceOnUse"
       xlink:href="#linearGradient5815-297-222"
       y2="33.670521" />
    <linearGradient
       id="linearGradient5815-297-222">
      <stop
         offset="0"
         id="stop2311"
         style="stop-color:#2a2a2a;stop-opacity:0;" />
      <stop
         offset="1"
         id="stop2313"
         style="stop-color:#2a2a2a;stop-opacity:0.50196081;" />
    </linearGradient>
    <radialGradient
       inkscape:collect="always"
       id="radialGradient4485-581-766"
       r="2.5"
       gradientTransform="matrix(-1.1627176e-2,-1.98854,1.9768786,-1.1559749e-2,-23.66887,124.74471)"
       cx="44.942196"
       cy="34.9711"
       gradientUnits="userSpaceOnUse"
       xlink:href="#linearGradient5815-27-115"
       fy="34.9711"
       fx="44.942196" />
    <linearGradient
       id="linearGradient5815-27-115">
      <stop
         offset="0"
         id="stop2317"
         style="stop-color:#2a2a2a;stop-opacity:0;" />
      <stop
         offset="1"
         id="stop2319"
         style="stop-color:#2a2a2a;stop-opacity:0.50196081;" />
    </linearGradient>
  </defs>
  <metadata
     id="metadata2204">
    <rdf:RDF>
      <cc:Work
         rdf:about="">
        <dc:format>image/svg+xml</dc:format>
        <dc:type
           rdf:resource="http://purl.org/dc/dcmitype/StillImage" />
      </cc:Work>
    </rdf:RDF>
  </metadata>
  <g
     inkscape:groupmode="layer"
     id="layer1"
     inkscape:label="Vrstva 1">
    <rect
       id="rect8889"
       x="0"
       y="0"
       width="140"
       height="20"
       ry="5"
       rx="5"
       style="fill:#bababa;fill-opacity:1;stroke:none;stroke-width:1;stroke-miterlimit:4;stroke-dasharray:none;stroke-opacity:1" />
    <g
       id="g4487"
       transform="translate(-50,0)">
      <rect
         id="rect5846"
         x="50"
         y="5"
         width="5"
         height="10"
         clip-path="none"
         style="fill:url(#linearGradient3464-286-860);fill-opacity:1;stroke:none;stroke-width:1;stroke-miterlimit:4;stroke-dasharray:none;stroke-opacity:1" />
      <rect
         id="rect5828"
         x="55"
         y="0"
         width="130"
         height="5"
         clip-path="none"
         style="fill:url(#linearGradient3466-863-789);fill-opacity:1;stroke:none;stroke-width:1;stroke-miterlimit:4;stroke-dasharray:none;stroke-opacity:1" />
      <path
         sodipodi:start="4.712389"
         id="path3470"
         sodipodi:end="6.2831853"
         sodipodi:cx="185"
         sodipodi:cy="5"
         d="M 185,8.8817842e-16 A 5,5 0 0 1 190,5 L 185,5 z"
         sodipodi:type="arc"
         style="fill:url(#linearGradient4461-549-258);fill-opacity:1;stroke:none;stroke-width:1;stroke-miterlimit:4;stroke-dasharray:none;stroke-opacity:1"
         sodipodi:ry="5"
         sodipodi:rx="5" />
      <path
         d="M 45,35 A 5,5 0 0 1 40,30 L 45,30 z"
         id="path4465"
         sodipodi:end="3.1415927"
         sodipodi:cx="45"
         sodipodi:cy="30"
         transform="translate(9.9999999,-15)"
         sodipodi:start="1.5707963"
         sodipodi:type="arc"
         style="fill:url(#linearGradient4473-942-956);fill-opacity:1;stroke:none;stroke-width:1;stroke-miterlimit:4;stroke-dasharray:none;stroke-opacity:1"
         sodipodi:ry="5"
         sodipodi:rx="5" />
      <path
         d="M 40,35 A 5,5 0 0 1 45,30 L 45,35 z"
         id="path4477"
         sodipodi:end="4.712389"
         sodipodi:cx="45"
         sodipodi:cy="35"
         transform="translate(9.9999999,-30)"
         sodipodi:start="3.1415927"
         sodipodi:type="arc"
         style="fill:url(#radialGradient4485-581-766);fill-opacity:1;stroke:none;stroke-width:1;stroke-miterlimit:4;stroke-dasharray:none;stroke-opacity:1"
         sodipodi:ry="5"
         sodipodi:rx="5" />
    </g>
  </g>
</svg>
