<?xml version="1.0" encoding="UTF-8" standalone="no"?>
<!-- Created with Inkscape (http://www.inkscape.org/) -->
<svg
   xmlns:dc="http://purl.org/dc/elements/1.1/"
   xmlns:cc="http://web.resource.org/cc/"
   xmlns:rdf="http://www.w3.org/1999/02/22-rdf-syntax-ns#"
   xmlns:svg="http://www.w3.org/2000/svg"
   xmlns="http://www.w3.org/2000/svg"
   xmlns:xlink="http://www.w3.org/1999/xlink"
   xmlns:sodipodi="http://sodipodi.sourceforge.net/DTD/sodipodi-0.dtd"
   xmlns:inkscape="http://www.inkscape.org/namespaces/inkscape"
   width="220"
   height="50"
   id="svg2"
   sodipodi:version="0.32"
   inkscape:version="0.45.1"
   version="1.0"
   sodipodi:docname="disk-bg.svg"
   sodipodi:docbase="/usr/local/share/screenlets/Disk/themes/cristal"
   inkscape:output_extension="org.inkscape.output.svg.inkscape">
  <sodipodi:namedview
     id="base"
     pagecolor="#ffffff"
     bordercolor="#666666"
     borderopacity="1.0"
     inkscape:pageopacity="0.0"
     inkscape:pageshadow="2"
     inkscape:zoom="1.4"
     inkscape:cx="206.52116"
     inkscape:cy="138.86453"
     inkscape:document-units="px"
     inkscape:current-layer="layer2"
     width="220px"
     height="50px"
     inkscape:window-width="896"
     inkscape:window-height="632"
     inkscape:window-x="244"
     inkscape:window-y="193" />
  <defs
     id="defs4">
    <linearGradient
       id="linearGradient4262">
      <stop
         offset="0"
         id="stop4264"
         style="stop-color:#696969;stop-opacity:0;" />
      <stop
         offset="1"
         id="stop4266"
         style="stop-color:#696969;stop-opacity:0.47272727;" />
    </linearGradient>
    <linearGradient
       id="linearGradient4146">
      <stop
         offset="0"
         id="stop4148"
         style="stop-color:#696969;stop-opacity:1;" />
      <stop
         offset="1"
         id="stop4150"
         style="stop-color:#696969;stop-opacity:0;" />
    </linearGradient>
    <linearGradient
       id="linearGradient4137">
      <stop
         offset="0"
         id="stop4139"
         style="stop-color:#101010;stop-opacity:0;" />
      <stop
         offset="1"
         id="stop4141"
         style="stop-color:#000000;stop-opacity:0.62272727;" />
    </linearGradient>
    <linearGradient
       inkscape:collect="always"
       id="linearGradient4114">
      <stop
         offset="0"
         id="stop4116"
         style="stop-color:#101010;stop-opacity:1;" />
      <stop
         offset="1"
         id="stop4118"
         style="stop-color:#101010;stop-opacity:0;" />
    </linearGradient>
    <filter
       inkscape:collect="always"
       id="filter3141">
      <feGaussianBlur
         inkscape:collect="always"
         id="feGaussianBlur3143"
         stdDeviation="1.2996429" />
    </filter>
    <linearGradient
       inkscape:collect="always"
       id="linearGradient4128"
       x1="21.67046"
       y1="19.404301"
       x2="425.15463"
       gradientUnits="userSpaceOnUse"
       xlink:href="#linearGradient4114"
       y2="197.20781" />
    <radialGradient
       inkscape:collect="always"
       id="radialGradient4135"
       r="180.3712"
       gradientTransform="matrix(1,0,0,0.4356876,0,55.222007)"
       cx="202.50002"
       cy="97.857147"
       gradientUnits="userSpaceOnUse"
       xlink:href="#linearGradient4137"
       fy="97.857147"
       fx="202.50002" />
    <linearGradient
       inkscape:collect="always"
       id="linearGradient4152"
       x1="202.5"
       y1="19.271662"
       x2="202.5"
       gradientUnits="userSpaceOnUse"
       xlink:href="#linearGradient4146"
       y2="176.44264" />
    <linearGradient
       inkscape:collect="always"
       id="linearGradient4268"
       x1="455.79065"
       y1="39.440891"
       x2="472.27121"
       gradientUnits="userSpaceOnUse"
       xlink:href="#linearGradient4262"
       y2="39.440891" />
    <linearGradient
       inkscape:collect="always"
       id="linearGradient4270"
       x1="430.854"
       y1="39.440891"
       x2="447.33456"
       gradientUnits="userSpaceOnUse"
       xlink:href="#linearGradient4262"
       y2="39.440891" />
    <linearGradient
       inkscape:collect="always"
       id="linearGradient4272"
       x1="405.9173"
       y1="39.440891"
       x2="422.39789"
       gradientUnits="userSpaceOnUse"
       xlink:href="#linearGradient4262"
       y2="39.440891" />
    <linearGradient
       inkscape:collect="always"
       id="linearGradient4274"
       x1="380.98065"
       y1="39.440891"
       x2="397.46121"
       gradientUnits="userSpaceOnUse"
       xlink:href="#linearGradient4262"
       y2="39.440891" />
    <linearGradient
       inkscape:collect="always"
       id="linearGradient4276"
       x1="356.04398"
       y1="39.440891"
       x2="372.52457"
       gradientUnits="userSpaceOnUse"
       xlink:href="#linearGradient4262"
       y2="39.440891" />
    <linearGradient
       inkscape:collect="always"
       id="linearGradient4278"
       x1="331.10733"
       y1="39.440891"
       x2="347.58789"
       gradientUnits="userSpaceOnUse"
       xlink:href="#linearGradient4262"
       y2="39.440891" />
    <linearGradient
       inkscape:collect="always"
       id="linearGradient4280"
       x1="306.17065"
       y1="39.440891"
       x2="322.65121"
       gradientUnits="userSpaceOnUse"
       xlink:href="#linearGradient4262"
       y2="39.440891" />
    <linearGradient
       inkscape:collect="always"
       id="linearGradient4282"
       x1="281.23398"
       y1="39.440891"
       x2="297.71457"
       gradientUnits="userSpaceOnUse"
       xlink:href="#linearGradient4262"
       y2="39.440891" />
    <linearGradient
       inkscape:collect="always"
       id="linearGradient4284"
       x1="256.29733"
       y1="39.440891"
       x2="272.77789"
       gradientUnits="userSpaceOnUse"
       xlink:href="#linearGradient4262"
       y2="39.440891" />
    <linearGradient
       inkscape:collect="always"
       id="linearGradient4286"
       x1="231.36066"
       y1="39.440891"
       x2="247.84125"
       gradientUnits="userSpaceOnUse"
       xlink:href="#linearGradient4262"
       y2="39.440891" />
    <linearGradient
       inkscape:collect="always"
       id="linearGradient4288"
       x1="206.424"
       y1="39.440891"
       x2="222.90457"
       gradientUnits="userSpaceOnUse"
       xlink:href="#linearGradient4262"
       y2="39.440891" />
    <linearGradient
       inkscape:collect="always"
       id="linearGradient4290"
       x1="181.48734"
       y1="39.440891"
       x2="197.96791"
       gradientUnits="userSpaceOnUse"
       xlink:href="#linearGradient4262"
       y2="39.440891" />
    <linearGradient
       inkscape:collect="always"
       id="linearGradient4292"
       x1="156.55066"
       y1="39.440891"
       x2="173.03123"
       gradientUnits="userSpaceOnUse"
       xlink:href="#linearGradient4262"
       y2="39.440891" />
    <linearGradient
       inkscape:collect="always"
       id="linearGradient4294"
       x1="131.614"
       y1="39.440891"
       x2="148.09457"
       gradientUnits="userSpaceOnUse"
       xlink:href="#linearGradient4262"
       y2="39.440891" />
    <linearGradient
       inkscape:collect="always"
       id="linearGradient4296"
       x1="106.67734"
       y1="39.440891"
       x2="123.15792"
       gradientUnits="userSpaceOnUse"
       xlink:href="#linearGradient4262"
       y2="39.440891" />
    <linearGradient
       inkscape:collect="always"
       id="linearGradient4298"
       x1="81.740669"
       y1="39.440891"
       x2="98.221245"
       gradientUnits="userSpaceOnUse"
       xlink:href="#linearGradient4262"
       y2="39.440891" />
    <linearGradient
       inkscape:collect="always"
       id="linearGradient4300"
       x1="56.804008"
       y1="39.440891"
       x2="73.284584"
       gradientUnits="userSpaceOnUse"
       xlink:href="#linearGradient4262"
       y2="39.440891" />
    <linearGradient
       inkscape:collect="always"
       id="linearGradient4302"
       x1="31.86734"
       y1="39.440891"
       x2="48.347919"
       gradientUnits="userSpaceOnUse"
       xlink:href="#linearGradient4262"
       y2="39.440891" />
    <linearGradient
       inkscape:collect="always"
       id="linearGradient4304"
       x1="6.9306765"
       y1="39.440891"
       x2="23.411255"
       gradientUnits="userSpaceOnUse"
       xlink:href="#linearGradient4262"
       y2="39.440891" />
    <linearGradient
       inkscape:collect="always"
       id="linearGradient4128-161"
       y2="197.20781"
       y1="19.404301"
       x2="425.15463"
       gradientUnits="userSpaceOnUse"
       xlink:href="#linearGradient4114-284"
       x1="21.67046" />
    <linearGradient
       inkscape:collect="always"
       id="linearGradient4114-284">
      <stop
         offset="0"
         id="stop2415"
         style="stop-color:#101010;stop-opacity:1;" />
      <stop
         offset="1"
         id="stop2417"
         style="stop-color:#101010;stop-opacity:0;" />
    </linearGradient>
    <linearGradient
       inkscape:collect="always"
       id="linearGradient4128-220"
       y2="197.20781"
       y1="19.404301"
       x2="425.15463"
       gradientUnits="userSpaceOnUse"
       xlink:href="#linearGradient4114-803"
       x1="21.67046" />
    <linearGradient
       inkscape:collect="always"
       id="linearGradient4114-803">
      <stop
         offset="0"
         id="stop2421"
         style="stop-color:#101010;stop-opacity:1;" />
      <stop
         offset="1"
         id="stop2423"
         style="stop-color:#101010;stop-opacity:0;" />
    </linearGradient>
    <radialGradient
       inkscape:collect="always"
       id="radialGradient4135-129"
       r="180.3712"
       gradientTransform="matrix(1,0,0,0.4356876,0,55.222007)"
       cx="202.50002"
       cy="97.857147"
       gradientUnits="userSpaceOnUse"
       xlink:href="#linearGradient4137-808"
       fy="97.857147"
       fx="202.50002" />
    <linearGradient
       id="linearGradient4137-808">
      <stop
         offset="0"
         id="stop2427"
         style="stop-color:#101010;stop-opacity:0;" />
      <stop
         offset="1"
         id="stop2429"
         style="stop-color:#000000;stop-opacity:0.62272727;" />
    </linearGradient>
    <linearGradient
       id="linearGradient4137-808-422">
      <stop
         offset="0"
         id="stop3131"
         style="stop-color:#101010;stop-opacity:0;" />
      <stop
         offset="1"
         id="stop3133"
         style="stop-color:#000000;stop-opacity:0.62272727;" />
    </linearGradient>
    <linearGradient
       gradientUnits="userSpaceOnUse"
       y2="39.440891"
       x2="23.411255"
       y1="39.440891"
       x1="6.9306765"
       id="linearGradient2389"
       xlink:href="#linearGradient4262"
       inkscape:collect="always" />
    <linearGradient
       gradientUnits="userSpaceOnUse"
       y2="39.440891"
       x2="48.347919"
       y1="39.440891"
       x1="31.86734"
       id="linearGradient2387"
       xlink:href="#linearGradient4262"
       inkscape:collect="always" />
    <linearGradient
       gradientUnits="userSpaceOnUse"
       y2="39.440891"
       x2="73.284584"
       y1="39.440891"
       x1="56.804008"
       id="linearGradient2385"
       xlink:href="#linearGradient4262"
       inkscape:collect="always" />
    <linearGradient
       gradientUnits="userSpaceOnUse"
       y2="39.440891"
       x2="98.221245"
       y1="39.440891"
       x1="81.740669"
       id="linearGradient2383"
       xlink:href="#linearGradient4262"
       inkscape:collect="always" />
    <linearGradient
       gradientUnits="userSpaceOnUse"
       y2="39.440891"
       x2="123.15792"
       y1="39.440891"
       x1="106.67734"
       id="linearGradient2381"
       xlink:href="#linearGradient4262"
       inkscape:collect="always" />
    <linearGradient
       gradientUnits="userSpaceOnUse"
       y2="39.440891"
       x2="148.09457"
       y1="39.440891"
       x1="131.614"
       id="linearGradient2379"
       xlink:href="#linearGradient4262"
       inkscape:collect="always" />
    <linearGradient
       gradientUnits="userSpaceOnUse"
       y2="39.440891"
       x2="173.03123"
       y1="39.440891"
       x1="156.55066"
       id="linearGradient2377"
       xlink:href="#linearGradient4262"
       inkscape:collect="always" />
    <linearGradient
       gradientUnits="userSpaceOnUse"
       y2="39.440891"
       x2="197.96791"
       y1="39.440891"
       x1="181.48734"
       id="linearGradient2375"
       xlink:href="#linearGradient4262"
       inkscape:collect="always" />
    <linearGradient
       gradientUnits="userSpaceOnUse"
       y2="39.440891"
       x2="222.90457"
       y1="39.440891"
       x1="206.424"
       id="linearGradient2373"
       xlink:href="#linearGradient4262"
       inkscape:collect="always" />
    <linearGradient
       gradientUnits="userSpaceOnUse"
       y2="39.440891"
       x2="247.84125"
       y1="39.440891"
       x1="231.36066"
       id="linearGradient2371"
       xlink:href="#linearGradient4262"
       inkscape:collect="always" />
    <linearGradient
       gradientUnits="userSpaceOnUse"
       y2="39.440891"
       x2="272.77789"
       y1="39.440891"
       x1="256.29733"
       id="linearGradient2369"
       xlink:href="#linearGradient4262"
       inkscape:collect="always" />
    <linearGradient
       gradientUnits="userSpaceOnUse"
       y2="39.440891"
       x2="297.71457"
       y1="39.440891"
       x1="281.23398"
       id="linearGradient2367"
       xlink:href="#linearGradient4262"
       inkscape:collect="always" />
    <linearGradient
       gradientUnits="userSpaceOnUse"
       y2="39.440891"
       x2="322.65121"
       y1="39.440891"
       x1="306.17065"
       id="linearGradient2365"
       xlink:href="#linearGradient4262"
       inkscape:collect="always" />
    <linearGradient
       gradientUnits="userSpaceOnUse"
       y2="39.440891"
       x2="347.58789"
       y1="39.440891"
       x1="331.10733"
       id="linearGradient2363"
       xlink:href="#linearGradient4262"
       inkscape:collect="always" />
    <linearGradient
       gradientUnits="userSpaceOnUse"
       y2="39.440891"
       x2="372.52457"
       y1="39.440891"
       x1="356.04398"
       id="linearGradient2361"
       xlink:href="#linearGradient4262"
       inkscape:collect="always" />
    <linearGradient
       gradientUnits="userSpaceOnUse"
       y2="39.440891"
       x2="397.46121"
       y1="39.440891"
       x1="380.98065"
       id="linearGradient2359"
       xlink:href="#linearGradient4262"
       inkscape:collect="always" />
    <linearGradient
       gradientUnits="userSpaceOnUse"
       y2="39.440891"
       x2="422.39789"
       y1="39.440891"
       x1="405.9173"
       id="linearGradient2357"
       xlink:href="#linearGradient4262"
       inkscape:collect="always" />
    <linearGradient
       gradientUnits="userSpaceOnUse"
       y2="39.440891"
       x2="447.33456"
       y1="39.440891"
       x1="430.854"
       id="linearGradient2355"
       xlink:href="#linearGradient4262"
       inkscape:collect="always" />
    <linearGradient
       gradientUnits="userSpaceOnUse"
       y2="39.440891"
       x2="472.27121"
       y1="39.440891"
       x1="455.79065"
       id="linearGradient2353"
       xlink:href="#linearGradient4262"
       inkscape:collect="always" />
    <linearGradient
       y2="176.44264"
       x2="202.5"
       y1="19.271662"
       x1="202.5"
       gradientUnits="userSpaceOnUse"
       id="linearGradient2351"
       xlink:href="#linearGradient4146"
       inkscape:collect="always" />
    <radialGradient
       gradientUnits="userSpaceOnUse"
       gradientTransform="matrix(1,0,0,0.4356876,0,55.222007)"
       r="180.3712"
       fy="97.857147"
       fx="202.50002"
       cy="97.857147"
       cx="202.50002"
       id="radialGradient2349"
       xlink:href="#linearGradient4137"
       inkscape:collect="always" />
    <linearGradient
       y2="197.20781"
       x2="425.15463"
       y1="19.404301"
       x1="21.67046"
       gradientUnits="userSpaceOnUse"
       id="linearGradient2347"
       xlink:href="#linearGradient4114"
       inkscape:collect="always" />
    <linearGradient
       id="linearGradient2335">
      <stop
         style="stop-color:#22e62f;stop-opacity:0;"
         offset="0"
         id="stop2337" />
      <stop
         style="stop-color:#000000;stop-opacity:0.62272727;"
         offset="1"
         id="stop2339" />
    </linearGradient>
    <linearGradient
       id="linearGradient2329">
      <stop
         style="stop-color:#ffffff;stop-opacity:1;"
         offset="0"
         id="stop2331" />
      <stop
         style="stop-color:#ffffff;stop-opacity:0;"
         offset="1"
         id="stop2333" />
    </linearGradient>
    <linearGradient
       id="linearGradient2323">
      <stop
         id="stop2325"
         offset="0"
         style="stop-color:#ffffff;stop-opacity:0;" />
      <stop
         id="stop2327"
         offset="1"
         style="stop-color:#ffffff;stop-opacity:0.47272727;" />
    </linearGradient>
    <linearGradient
       id="linearGradient4220">
      <stop
         id="stop4222"
         offset="0"
         style="stop-color:#0000ff;stop-opacity:1;" />
      <stop
         id="stop4224"
         offset="1"
         style="stop-color:#1200ff;stop-opacity:0.78571427;" />
    </linearGradient>
    <linearGradient
       id="linearGradient6178">
      <stop
         id="stop6180"
         offset="0"
         style="stop-color:#0000ff;stop-opacity:1;" />
      <stop
         id="stop6182"
         offset="1"
         style="stop-color:#0000ff;stop-opacity:0.60204083;" />
    </linearGradient>
  </defs>
  <metadata
     id="metadata7">
    <rdf:RDF>
      <cc:Work
         rdf:about="">
        <dc:format>image/svg+xml</dc:format>
        <dc:type
           rdf:resource="http://purl.org/dc/dcmitype/StillImage" />
      </cc:Work>
    </rdf:RDF>
  </metadata>
  <g
     inkscape:groupmode="layer"
     id="layer1"
     inkscape:label="button"
     style="display:inline" />
  <g
     inkscape:groupmode="layer"
     id="layer2"
     inkscape:label="schatten"
     style="display:inline">
    <rect
       id="rect2168"
       x="22.128807"
       y="19.271662"
       width="360.7424"
       height="157.17097"
       ry="19.301697"
       rx="19.575169"
       style="fill:#000000;fill-opacity:0.03448276;fill-rule:evenodd;stroke:none;stroke-width:0.9718976px;stroke-linecap:butt;stroke-linejoin:miter;stroke-opacity:1;display:inline;filter:url(#filter3141)"
       transform="matrix(0.5544122,0,0,0.3181249,7.7315194,-6.130796)" />
    <rect
       id="rect4130"
       x="22.128807"
       y="19.271662"
       width="360.7424"
       height="157.17097"
       ry="19.301697"
       rx="19.575169"
       style="fill:#000000;fill-opacity:0.03448276;fill-rule:evenodd;stroke:none;stroke-width:0.9718976px;stroke-linecap:butt;stroke-linejoin:miter;stroke-opacity:1;display:inline;filter:url(#filter3141)"
       transform="matrix(0.5544122,0,0,0.3181249,7.7315194,-6.130796)" />
    <rect
       id="rect4133"
       x="22.128807"
       y="19.271662"
       width="360.7424"
       height="157.17097"
       ry="19.301697"
       rx="19.575169"
       style="fill:#000000;fill-opacity:0.03448276;fill-rule:evenodd;stroke:none;stroke-width:0.9718976px;stroke-linecap:butt;stroke-linejoin:miter;stroke-opacity:1;display:inline;filter:url(#filter3141)"
       transform="matrix(0.5544122,0,0,0.3181249,7.7315194,-6.130796)" />
    <g
       style="fill:#808080;display:inline"
       inkscape:label="logo"
       id="layer4"
       transform="matrix(1.0555556,0,0,1,25,35)">
      <rect
         y="0"
         x="0"
         height="6"
         width="180"
         id="rect2211"
         style="fill:#808080;fill-opacity:1;fill-rule:evenodd;stroke:none;stroke-width:0.741;stroke-linecap:butt;stroke-linejoin:miter;stroke-miterlimit:4;stroke-dasharray:none;stroke-opacity:1" />
    </g>
  </g>
</svg>
