<?xml version="1.0" encoding="UTF-8" standalone="no"?>
<!-- Created with Inkscape (http://www.inkscape.org/) -->
<svg
   xmlns:dc="http://purl.org/dc/elements/1.1/"
   xmlns:cc="http://web.resource.org/cc/"
   xmlns:rdf="http://www.w3.org/1999/02/22-rdf-syntax-ns#"
   xmlns:svg="http://www.w3.org/2000/svg"
   xmlns="http://www.w3.org/2000/svg"
   xmlns:xlink="http://www.w3.org/1999/xlink"
   xmlns:sodipodi="http://sodipodi.sourceforge.net/DTD/sodipodi-0.dtd"
   xmlns:inkscape="http://www.inkscape.org/namespaces/inkscape"
   width="200"
   height="40"
   id="svg2"
   inkscape:label="Pozadí"
   sodipodi:version="0.32"
   inkscape:version="0.45.1"
   version="1.0"
   sodipodi:docbase="/usr/local/share/screenlets/Euromillions/themes/default"
   sodipodi:docname="glass.svg"
   inkscape:output_extension="org.inkscape.output.svg.inkscape">
  <defs
     id="defs12977">
    <linearGradient
       id="linearGradient7032">
      <stop
         style="stop-color:#ffffff;stop-opacity:0.56910568;"
         offset="0"
         id="stop7034" />
      <stop
         style="stop-color:#ffffff;stop-opacity:0;"
         offset="1"
         id="stop7036" />
    </linearGradient>
    <linearGradient
       inkscape:collect="always"
       xlink:href="#linearGradient7032"
       id="linearGradient12885"
       gradientUnits="userSpaceOnUse"
       gradientTransform="matrix(0.99,0,0,0.3266666,1.0000003,1.666667)"
       x1="100"
       y1="1.0204073"
       x2="100"
       y2="102.04083" />
  </defs>
  <sodipodi:namedview
     id="base"
     pagecolor="#ffffff"
     bordercolor="#666666"
     borderopacity="1.0"
     inkscape:pageopacity="0.0"
     inkscape:pageshadow="2"
     inkscape:zoom="1.4"
     inkscape:cx="96.829801"
     inkscape:cy="50.589001"
     inkscape:document-units="px"
     inkscape:current-layer="layer1"
     height="40px"
     width="200px"
     inkscape:window-width="910"
     inkscape:window-height="626"
     inkscape:window-x="370"
     inkscape:window-y="122" />
  <metadata
     id="metadata12980">
    <rdf:RDF>
      <cc:Work
         rdf:about="">
        <dc:format>image/svg+xml</dc:format>
        <dc:type
           rdf:resource="http://purl.org/dc/dcmitype/StillImage" />
      </cc:Work>
    </rdf:RDF>
  </metadata>
  <g
     inkscape:label="Vrstva 1"
     inkscape:groupmode="layer"
     id="layer1">
    <path
       style="fill:url(#linearGradient12885);fill-opacity:1;stroke:none;stroke-width:0.99255276;stroke-miterlimit:4;stroke-opacity:1"
       d="M 11.8,2 L 188.2,2 C 194.43307,2 198,3.164553 198,5.266667 L 197.28571,35 C 197.28571,35 127.99711,22.285714 101.26984,22.285714 C 74.542569,22.285714 2,34.857143 2,34.857143 L 2,5.266667 C 2,3.185913 5.5050763,2 11.8,2 z "
       id="rect11911"
       sodipodi:nodetypes="cccczccc" />
  </g>
</svg>
