<?xml version="1.0" encoding="UTF-8" standalone="no"?>
<!-- Created with Inkscape (http://www.inkscape.org/) -->
<svg
   xmlns:dc="http://purl.org/dc/elements/1.1/"
   xmlns:cc="http://creativecommons.org/ns#"
   xmlns:rdf="http://www.w3.org/1999/02/22-rdf-syntax-ns#"
   xmlns:svg="http://www.w3.org/2000/svg"
   xmlns="http://www.w3.org/2000/svg"
   xmlns:xlink="http://www.w3.org/1999/xlink"
   xmlns:sodipodi="http://sodipodi.sourceforge.net/DTD/sodipodi-0.dtd"
   xmlns:inkscape="http://www.inkscape.org/namespaces/inkscape"
   width="200"
   height="40"
   id="svg2"
   sodipodi:version="0.32"
   inkscape:version="0.46"
   version="1.0"
   sodipodi:docbase="/home/helder/screenlets/src/share/screenlets/Search/themes/default"
   sodipodi:docname="background.svg"
   inkscape:output_extension="org.inkscape.output.svg.inkscape">
  <defs
     id="defs4">
    <inkscape:perspective
       sodipodi:type="inkscape:persp3d"
       inkscape:vp_x="0 : 20 : 1"
       inkscape:vp_y="0 : 1000 : 0"
       inkscape:vp_z="200 : 20 : 1"
       inkscape:persp3d-origin="100 : 13.333333 : 1"
       id="perspective68" />
    <linearGradient
       id="linearGradient7153">
      <stop
         style="stop-color:#000000;stop-opacity:1;"
         offset="0"
         id="stop7155" />
      <stop
         style="stop-color:#666666;stop-opacity:0;"
         offset="1"
         id="stop7157" />
    </linearGradient>
    <linearGradient
       inkscape:collect="always"
       id="linearGradient6154">
      <stop
         style="stop-color:#ffffff;stop-opacity:1;"
         offset="0"
         id="stop6156" />
      <stop
         style="stop-color:#ffffff;stop-opacity:0;"
         offset="1"
         id="stop6158" />
    </linearGradient>
    <linearGradient
       id="linearGradient9839">
      <stop
         style="stop-color:black;stop-opacity:1;"
         offset="0"
         id="stop9841" />
      <stop
         id="stop10734"
         offset="0.5"
         style="stop-color:black;stop-opacity:1;" />
      <stop
         style="stop-color:black;stop-opacity:0;"
         offset="1"
         id="stop9843" />
    </linearGradient>
    <linearGradient
       id="linearGradient7169">
      <stop
         style="stop-color:black;stop-opacity:1;"
         offset="0"
         id="stop7171" />
      <stop
         style="stop-color:black;stop-opacity:0;"
         offset="1"
         id="stop7173" />
    </linearGradient>
    <linearGradient
       id="linearGradient5389">
      <stop
         style="stop-color:black;stop-opacity:0.63265306;"
         offset="0"
         id="stop5391" />
      <stop
         style="stop-color:black;stop-opacity:0;"
         offset="1"
         id="stop5393" />
    </linearGradient>
    <linearGradient
       id="linearGradient2802">
      <stop
         style="stop-color:black;stop-opacity:0.66326529;"
         offset="0"
         id="stop2804" />
      <stop
         style="stop-color:black;stop-opacity:0"
         offset="1"
         id="stop2806" />
    </linearGradient>
    <linearGradient
       id="linearGradient3690">
      <stop
         style="stop-color:#3e3e3e;stop-opacity:1;"
         offset="0"
         id="stop3692" />
      <stop
         id="stop2796"
         offset="0.19"
         style="stop-color:#1d1d1d;stop-opacity:1;" />
      <stop
         id="stop2794"
         offset="0.93000001"
         style="stop-color:black;stop-opacity:1;" />
      <stop
         style="stop-color:#7c7c7c;stop-opacity:1;"
         offset="1"
         id="stop3694" />
    </linearGradient>
    <linearGradient
       id="linearGradient2769">
      <stop
         style="stop-color:white;stop-opacity:1;"
         offset="0"
         id="stop2771" />
      <stop
         style="stop-color:white;stop-opacity:0;"
         offset="1"
         id="stop2773" />
    </linearGradient>
    <linearGradient
       gradientUnits="userSpaceOnUse"
       y2="22.941767"
       x2="47.791164"
       y1="22.941767"
       x1="10.441769"
       id="linearGradient3101"
       xlink:href="#linearGradient2202"
       inkscape:collect="always" />
    <linearGradient
       id="linearGradient2202">
      <stop
         id="stop2204"
         offset="0"
         style="stop-color:#cfd3d3;stop-opacity:1;" />
      <stop
         id="stop2206"
         offset="1"
         style="stop-color:#f7fcf9;stop-opacity:1;" />
    </linearGradient>
    <linearGradient
       gradientUnits="userSpaceOnUse"
       y2="93.997551"
       x2="60.037991"
       y1="8.4583349"
       x1="59.798409"
       id="linearGradient2825"
       xlink:href="#linearGradient2202"
       inkscape:collect="always" />
    <linearGradient
       id="linearGradient2070">
      <stop
         id="stop2072"
         offset="0"
         style="stop-color:#bcffa3;stop-opacity:1;" />
      <stop
         id="stop2074"
         offset="1"
         style="stop-color:#487625;stop-opacity:1;" />
    </linearGradient>
    <linearGradient
       id="linearGradient2811"
       gradientTransform="scale(2.218359,0.450784)"
       x1="4.3739681"
       y1="167.72368"
       x2="39.267525"
       y2="167.72368"
       gradientUnits="userSpaceOnUse">
      <stop
         id="stop2813"
         offset="0"
         style="stop-color:black;stop-opacity:0.3141593;" />
      <stop
         id="stop2815"
         offset="1"
         style="stop-color:black;stop-opacity:0;" />
    </linearGradient>
    <linearGradient
       gradientTransform="matrix(0.942544,0,0,0.921824,2.781224,4.166134)"
       gradientUnits="userSpaceOnUse"
       y2="68.967857"
       x2="55.155025"
       y1="106.66622"
       x1="55.137867"
       id="linearGradient2228"
       xlink:href="#linearGradient2805"
       inkscape:collect="always" />
    <linearGradient
       id="linearGradient2760">
      <stop
         id="stop2762"
         offset="0"
         style="stop-color:#ff1f1f;stop-opacity:0.75663716;" />
      <stop
         id="stop2764"
         offset="1"
         style="stop-color:#cb0000;stop-opacity:0.80973452;" />
    </linearGradient>
    <linearGradient
       id="linearGradient2805">
      <stop
         id="stop2807"
         offset="0"
         style="stop-color:black;stop-opacity:1;" />
      <stop
         id="stop2809"
         offset="1"
         style="stop-color:black;stop-opacity:0;" />
    </linearGradient>
    <linearGradient
       gradientUnits="userSpaceOnUse"
       y2="93.997551"
       x2="60.037991"
       y1="8.4583349"
       x1="59.798409"
       id="linearGradient2259"
       xlink:href="#linearGradient2202"
       inkscape:collect="always" />
    <linearGradient
       id="linearGradient2251">
      <stop
         id="stop2253"
         offset="0"
         style="stop-color:#bcffa3;stop-opacity:1;" />
      <stop
         id="stop2255"
         offset="1"
         style="stop-color:#487625;stop-opacity:1;" />
    </linearGradient>
    <linearGradient
       id="linearGradient2241">
      <stop
         id="stop2243"
         offset="0"
         style="stop-color:black;stop-opacity:0.3141593;" />
      <stop
         id="stop2245"
         offset="1"
         style="stop-color:black;stop-opacity:0;" />
    </linearGradient>
    <radialGradient
       inkscape:collect="always"
       xlink:href="#linearGradient9839"
       id="radialGradient10732"
       cx="91.5625"
       cy="68.984406"
       fx="91.5625"
       fy="68.984406"
       r="4.21875"
       gradientTransform="matrix(2.22652,5.254427e-6,-6.228482e-6,2.521498,-112.3029,-105.7258)"
       gradientUnits="userSpaceOnUse" />
    <linearGradient
       inkscape:collect="always"
       xlink:href="#linearGradient6154"
       id="linearGradient6160"
       x1="60"
       y1="19"
       x2="60"
       y2="34.505085"
       gradientUnits="userSpaceOnUse"
       gradientTransform="matrix(1.6820038,0,0,0.9426211,-8.0688817,-16.349224)" />
    <linearGradient
       inkscape:collect="always"
       xlink:href="#linearGradient7153"
       id="linearGradient7159"
       x1="64.5"
       y1="97"
       x2="65"
       y2="-49"
       gradientUnits="userSpaceOnUse"
       gradientTransform="matrix(1.6628891,0,0,0.4943333,-8.0877796,-8.762295)" />
  </defs>
  <sodipodi:namedview
     id="base"
     pagecolor="#ffffff"
     bordercolor="#666666"
     borderopacity="1.0"
     inkscape:pageopacity="0.0"
     inkscape:pageshadow="2"
     inkscape:zoom="11.313708"
     inkscape:cx="18.191912"
     inkscape:cy="19.651739"
     inkscape:document-units="px"
     inkscape:current-layer="layer3"
     width="200px"
     height="40px"
     inkscape:window-width="1120"
     inkscape:window-height="741"
     inkscape:window-x="8"
     inkscape:window-y="26"
     showgrid="false" />
  <metadata
     id="metadata7">
    <rdf:RDF>
      <cc:Work
         rdf:about="">
        <dc:format>image/svg+xml</dc:format>
        <dc:type
           rdf:resource="http://purl.org/dc/dcmitype/StillImage" />
      </cc:Work>
    </rdf:RDF>
  </metadata>
  <g
     inkscape:groupmode="layer"
     id="layer3"
     inkscape:label="face-shadow">
    <text
       xml:space="preserve"
       style="font-size:12px;font-style:normal;font-weight:normal;fill:#f9f9f9;fill-opacity:1;stroke:none;stroke-width:1px;stroke-linecap:butt;stroke-linejoin:miter;stroke-opacity:1;font-family:Bitstream Vera Sans"
       x="29.104437"
       y="31.695332"
       id="text1920"><tspan
         sodipodi:role="line"
         id="tspan1922"
         x="29.104437"
         y="31.695332" /></text>
    <text
       xml:space="preserve"
       style="font-size:12px;font-style:normal;font-weight:normal;fill:#f2f2f2;fill-opacity:1;stroke:none;stroke-width:1px;stroke-linecap:butt;stroke-linejoin:miter;stroke-opacity:1;font-family:Bitstream Vera Sans"
       x="27.384535"
       y="28.255527"
       id="text2057"><tspan
         sodipodi:role="line"
         id="tspan2059"
         x="27.384535"
         y="28.255527" /></text>
    <path
       style="opacity:1;fill:url(#linearGradient7159);fill-opacity:1;fill-rule:nonzero;stroke:#090909;stroke-width:0.45332697;stroke-linecap:butt;stroke-linejoin:round;stroke-miterlimit:4;stroke-dasharray:none;stroke-opacity:1"
       d="M 7.463086,0.22666276 C -0.1685016,0.22666276 0.27027265,5.3319935 0.27027265,7.431198 L 0.27,32.353324 C 0.27,34.452527 -0.4185016,40.023335 7.213086,40.023336 L 193.03686,39.773336 C 200.66851,39.773336 200.02333,34.530108 200.02333,32.430906 L 200.02333,7.7415166 C 200.02333,5.8065529 199.8229,0.49964137 193.0291,0.2631119 C 192.75455,0.26926664 187.25843,0.28133742 186.97499,0.28133742 C 186.35409,0.28133742 185.73957,0.25520629 185.16588,0.22666276 L 7.463086,0.22666276 z"
       id="rect2803"
       sodipodi:nodetypes="ccccccccscc" />
    <rect
       style="opacity:0.59717317;fill:url(#linearGradient6160);fill-opacity:1;fill-rule:evenodd;stroke:none;stroke-width:0.98983228px;stroke-linecap:butt;stroke-linejoin:miter;stroke-opacity:1"
       id="rect4162"
       width="199.33458"
       height="15.562833"
       x="0.33258441"
       y="0.61316717"
       ry="7.7814164"
       rx="4.75" />
  </g>
</svg>
