<?xml version="1.0" encoding="UTF-8" standalone="no"?>
<!-- Created with Inkscape (http://www.inkscape.org/) -->
<svg
   xmlns:dc="http://purl.org/dc/elements/1.1/"
   xmlns:cc="http://web.resource.org/cc/"
   xmlns:rdf="http://www.w3.org/1999/02/22-rdf-syntax-ns#"
   xmlns:svg="http://www.w3.org/2000/svg"
   xmlns="http://www.w3.org/2000/svg"
   xmlns:sodipodi="http://sodipodi.sourceforge.net/DTD/sodipodi-0.dtd"
   xmlns:inkscape="http://www.inkscape.org/namespaces/inkscape"
   width="100"
   height="100"
   id="svg4230"
   sodipodi:version="0.32"
   inkscape:version="0.44"
   version="1.0"
   sodipodi:docbase="/home/ryx/Documents/scripts/python/screenlets/clock/themes/time4linux-white"
   sodipodi:docname="clock-hour-hand.svg">
  <defs
     id="defs4232" />
  <sodipodi:namedview
     id="base"
     pagecolor="#ffffff"
     bordercolor="#666666"
     borderopacity="1.0"
     inkscape:pageopacity="0.0"
     inkscape:pageshadow="2"
     inkscape:zoom="4.08"
     inkscape:cx="50"
     inkscape:cy="69.485294"
     inkscape:document-units="px"
     inkscape:current-layer="layer1"
     height="100px"
     width="100px"
     inkscape:window-width="989"
     inkscape:window-height="626"
     inkscape:window-x="61"
     inkscape:window-y="278" />
  <metadata
     id="metadata4235">
    <rdf:RDF>
      <cc:Work
         rdf:about="">
        <dc:format>image/svg+xml</dc:format>
        <dc:type
           rdf:resource="http://purl.org/dc/dcmitype/StillImage" />
      </cc:Work>
    </rdf:RDF>
  </metadata>
  <g
     inkscape:label="Ebene 1"
     inkscape:groupmode="layer"
     id="layer1"
     transform="translate(-12.63383,-7.215581)">
    <g
       id="g4275"
       transform="matrix(0,1,-1,0,62.83321,-43.31504)"
       style="fill:black">
      <path
         sodipodi:nodetypes="cccc"
         id="rect2884"
         d="M 50.65585,27.55683 L 52.671984,47.844863 L 48.3877,47.844863 L 50.65585,27.55683 z "
         style="fill:black;fill-opacity:1;stroke:none;stroke-width:2;stroke-linejoin:miter;stroke-miterlimit:4;stroke-dashoffset:0;stroke-opacity:1" />
      <path
         transform="matrix(0.77201,0,0,0.77201,11.55093,10.19604)"
         d="M 55.742811 51.623203 A 5.3751998 5.3751998 0 1 1  44.992411,51.623203 A 5.3751998 5.3751998 0 1 1  55.742811 51.623203 z"
         sodipodi:ry="5.3751998"
         sodipodi:rx="5.3751998"
         sodipodi:cy="51.623203"
         sodipodi:cx="50.367611"
         id="path2887"
         style="fill:black;fill-opacity:1;stroke:none;stroke-width:2;stroke-linejoin:miter;stroke-miterlimit:4;stroke-dasharray:none;stroke-dashoffset:0;stroke-opacity:1"
         sodipodi:type="arc" />
    </g>
  </g>
</svg>
