<?xml version="1.0" encoding="UTF-8" standalone="no"?>
<!-- Created with Inkscape (http://www.inkscape.org/) -->
<svg
   xmlns:dc="http://purl.org/dc/elements/1.1/"
   xmlns:cc="http://web.resource.org/cc/"
   xmlns:rdf="http://www.w3.org/1999/02/22-rdf-syntax-ns#"
   xmlns:svg="http://www.w3.org/2000/svg"
   xmlns="http://www.w3.org/2000/svg"
   xmlns:xlink="http://www.w3.org/1999/xlink"
   xmlns:sodipodi="http://sodipodi.sourceforge.net/DTD/sodipodi-0.dtd"
   xmlns:inkscape="http://www.inkscape.org/namespaces/inkscape"
   width="100"
   height="30"
   id="svg2"
   sodipodi:version="0.32"
   inkscape:version="0.45"
   version="1.0"
   sodipodi:docbase="/home/ryx/Documents/scripts/python/screenlets/screenlets-0.0.10/src/share/screenlets/CopyStack/themes/default"
   sodipodi:docname="copystack-base.svg"
   inkscape:output_extension="org.inkscape.output.svg.inkscape"
   sodipodi:modified="true">
  <defs
     id="defs4">
    <linearGradient
       inkscape:collect="always"
       id="linearGradient3184">
      <stop
         style="stop-color:#ffffff;stop-opacity:1;"
         offset="0"
         id="stop3186" />
      <stop
         style="stop-color:#ffffff;stop-opacity:0;"
         offset="1"
         id="stop3188" />
    </linearGradient>
    <linearGradient
       inkscape:collect="always"
       xlink:href="#linearGradient3184"
       id="linearGradient3190"
       x1="24.220844"
       y1="0.55865914"
       x2="31.758907"
       y2="23.12849"
       gradientUnits="userSpaceOnUse"
       gradientTransform="matrix(1,0,0,0.4117647,0,7.764706)" />
  </defs>
  <sodipodi:namedview
     id="base"
     pagecolor="#ffffff"
     bordercolor="#666666"
     borderopacity="1.0"
     inkscape:pageopacity="0.0"
     inkscape:pageshadow="2"
     inkscape:zoom="4.475"
     inkscape:cx="45.221597"
     inkscape:cy="25.404427"
     inkscape:document-units="px"
     inkscape:current-layer="layer1"
     width="100px"
     height="30px"
     inkscape:window-width="989"
     inkscape:window-height="626"
     inkscape:window-x="229"
     inkscape:window-y="101" />
  <metadata
     id="metadata7">
    <rdf:RDF>
      <cc:Work
         rdf:about="">
        <dc:format>image/svg+xml</dc:format>
        <dc:type
           rdf:resource="http://purl.org/dc/dcmitype/StillImage" />
      </cc:Work>
    </rdf:RDF>
  </metadata>
  <g
     inkscape:label="Ebene 1"
     inkscape:groupmode="layer"
     id="layer1">
    <path
       style="color:#000000;fill:#000000;fill-opacity:0.27986348;fill-rule:evenodd;stroke:none;stroke-width:0.99999994;stroke-linecap:butt;stroke-linejoin:round;marker:none;marker-start:none;marker-mid:none;marker-end:none;stroke-miterlimit:4;stroke-dashoffset:0;stroke-opacity:1;visibility:visible;display:inline;overflow:visible"
       d="M 26.613904,16 L 73.386096,16 L 92.094972,30 L 7.9050279,30 L 26.613904,16 z "
       id="path4161"
       sodipodi:nodetypes="ccccc" />
    <path
       style="color:#000000;fill:#008080;fill-opacity:0.86006829;fill-rule:evenodd;stroke:#797979;stroke-width:0.99999994;stroke-linecap:butt;stroke-linejoin:round;marker:none;marker-start:none;marker-mid:none;marker-end:none;stroke-miterlimit:4;stroke-dashoffset:0;stroke-opacity:1;visibility:visible;display:inline;overflow:visible"
       d="M 25,15 L 75,15 L 95,29 L 5,29 L 25,15 z "
       id="path2190"
       sodipodi:nodetypes="ccccc" />
    <path
       style="color:#000000;fill:#008080;fill-opacity:0.86006829;fill-rule:evenodd;stroke:#797979;stroke-width:0.99999994;stroke-linecap:butt;stroke-linejoin:round;marker:none;marker-start:none;marker-mid:none;marker-end:none;stroke-miterlimit:4;stroke-dashoffset:0;stroke-opacity:1;visibility:visible;display:inline;overflow:visible"
       d="M 24.888268,9.044693 L 75.335196,9.044693 L 75,15 L 25,15 L 24.888268,9.044693 z "
       id="path2195"
       sodipodi:nodetypes="ccccc" />
    <path
       style="color:#000000;fill:#008080;fill-opacity:0.86006829;fill-rule:evenodd;stroke:#005757;stroke-width:0.99999994;stroke-linecap:butt;stroke-linejoin:round;marker:none;marker-start:none;marker-mid:none;marker-end:none;stroke-miterlimit:4;stroke-dashoffset:0;stroke-opacity:1;visibility:visible;display:inline;overflow:visible"
       d="M 25,9 L 75,9 L 95,23 L 5,23 L 25,9 z "
       id="rect2224"
       sodipodi:nodetypes="ccccc" />
    <path
       style="color:#000000;fill:url(#linearGradient3190);fill-opacity:1;fill-rule:evenodd;stroke:none;stroke-width:1;stroke-linecap:butt;stroke-linejoin:round;marker:none;marker-start:none;marker-mid:none;marker-end:none;stroke-miterlimit:4;stroke-dashoffset:0;stroke-opacity:1;visibility:visible;display:inline;overflow:visible"
       d="M 25.75,9.231618 L 14.65625,16.977941 C 26.013868,13.009183 48.56331,10.299632 74.53125,10.299632 C 74.952113,10.299632 75.362206,10.298217 75.78125,10.299632 L 74.25,9.231618 L 25.75,9.231618 z M 6.875,22.395221 L 6.34375,22.768382 L 6.8125,22.768382 C 6.814554,22.643201 6.8531619,22.519515 6.875,22.395221 z "
       id="path2192" />
    <path
       style="color:#000000;fill:#008080;fill-opacity:0.86006829;fill-rule:evenodd;stroke:#005757;stroke-width:0.99999994;stroke-linecap:butt;stroke-linejoin:round;marker:none;marker-start:none;marker-mid:none;marker-end:none;stroke-miterlimit:4;stroke-dashoffset:0;stroke-opacity:1;visibility:visible;display:inline;overflow:visible"
       d="M 4.8882682,23.044693 L 95.335196,23.044693 L 95,29 L 5,29 L 4.8882682,23.044693 z "
       id="path2193"
       sodipodi:nodetypes="ccccc" />
  </g>
</svg>
