<?xml version="1.0" encoding="UTF-8" standalone="no"?>
<!-- Created with Inkscape (http://www.inkscape.org/) -->
<svg
   xmlns:dc="http://purl.org/dc/elements/1.1/"
   xmlns:cc="http://web.resource.org/cc/"
   xmlns:rdf="http://www.w3.org/1999/02/22-rdf-syntax-ns#"
   xmlns:svg="http://www.w3.org/2000/svg"
   xmlns="http://www.w3.org/2000/svg"
   xmlns:xlink="http://www.w3.org/1999/xlink"
   xmlns:sodipodi="http://sodipodi.sourceforge.net/DTD/sodipodi-0.dtd"
   xmlns:inkscape="http://www.inkscape.org/namespaces/inkscape"
   width="64"
   height="64"
   id="svg2"
   sodipodi:version="0.32"
   inkscape:version="0.45"
   version="1.0"
   sodipodi:docbase="/home/ryx/Documents/scripts/python/screenlets/screenlets-0.0.8/src/share/screenlets/Picframe/themes/default"
   sodipodi:docname="picframe-frame.svg"
   inkscape:output_extension="org.inkscape.output.svg.inkscape"
   sodipodi:modified="true">
  <defs
     id="defs4">
    <linearGradient
       id="linearGradient3322">
      <stop
         id="stop3324"
         offset="0"
         style="stop-color:#ffffff;stop-opacity:1;" />
      <stop
         id="stop3326"
         offset="1"
         style="stop-color:#000000;stop-opacity:0;" />
    </linearGradient>
    <linearGradient
       id="linearGradient3316">
      <stop
         id="stop3318"
         offset="0"
         style="stop-color:#000000;stop-opacity:1;" />
      <stop
         id="stop3320"
         offset="1"
         style="stop-color:#ffffff;stop-opacity:0;" />
    </linearGradient>
    <linearGradient
       id="linearGradient3310">
      <stop
         id="stop3312"
         offset="0"
         style="stop-color:#000000;stop-opacity:1;" />
      <stop
         id="stop3314"
         offset="1"
         style="stop-color:#ffffff;stop-opacity:0;" />
    </linearGradient>
    <linearGradient
       id="linearGradient3304">
      <stop
         id="stop3306"
         offset="0"
         style="stop-color:#ffffff;stop-opacity:1;" />
      <stop
         id="stop3308"
         offset="1"
         style="stop-color:#000000;stop-opacity:0;" />
    </linearGradient>
    <linearGradient
       id="linearGradient3263">
      <stop
         style="stop-color:#000000;stop-opacity:1;"
         offset="0"
         id="stop3265" />
      <stop
         style="stop-color:#000000;stop-opacity:0;"
         offset="1"
         id="stop3267" />
    </linearGradient>
    <linearGradient
       inkscape:collect="always"
       id="linearGradient3245">
      <stop
         style="stop-color:#ffffff;stop-opacity:1;"
         offset="0"
         id="stop3247" />
      <stop
         style="stop-color:#ffffff;stop-opacity:0;"
         offset="1"
         id="stop3249" />
    </linearGradient>
    <linearGradient
       id="linearGradient3369">
      <stop
         style="stop-color:#552200;stop-opacity:1;"
         offset="0"
         id="stop3371" />
      <stop
         style="stop-color:#9e3f00;stop-opacity:1;"
         offset="1"
         id="stop3373" />
    </linearGradient>
    <linearGradient
       id="linearGradient3148">
      <stop
         style="stop-color:#000000;stop-opacity:0;"
         offset="0"
         id="stop3150" />
      <stop
         style="stop-color:#000000;stop-opacity:1;"
         offset="1"
         id="stop3152" />
    </linearGradient>
    <linearGradient
       inkscape:collect="always"
       xlink:href="#linearGradient3148"
       id="linearGradient3154"
       x1="33.652336"
       y1="36.240788"
       x2="35.135136"
       y2="47.051598"
       gradientUnits="userSpaceOnUse" />
    <linearGradient
       inkscape:collect="always"
       xlink:href="#linearGradient3369"
       id="linearGradient3375"
       x1="56.495468"
       y1="66.194832"
       x2="42.011978"
       y2="62.755028"
       gradientUnits="userSpaceOnUse"
       gradientTransform="translate(0.7371007,-0.4914005)" />
    <linearGradient
       inkscape:collect="always"
       xlink:href="#linearGradient3369"
       id="linearGradient2218"
       gradientUnits="userSpaceOnUse"
       gradientTransform="translate(0.7371007,-0.4914005)"
       x1="56.495468"
       y1="66.194832"
       x2="42.011978"
       y2="62.755028" />
    <linearGradient
       inkscape:collect="always"
       xlink:href="#linearGradient3245"
       id="linearGradient3251"
       x1="5.982801"
       y1="50"
       x2="15.651106"
       y2="51.474201"
       gradientUnits="userSpaceOnUse"
       gradientTransform="matrix(0.5970751,0,0,0.5962124,2.0146245,6.896242)" />
    <linearGradient
       inkscape:collect="always"
       xlink:href="#linearGradient3245"
       id="linearGradient3257"
       gradientUnits="userSpaceOnUse"
       x1="5.982801"
       y1="50"
       x2="16.633907"
       y2="48.034397"
       gradientTransform="matrix(0,0.5962124,-0.5970751,0,62.019205,6.5996007)" />
    <linearGradient
       inkscape:collect="always"
       xlink:href="#linearGradient3263"
       id="linearGradient3269"
       x1="16.30221"
       y1="50.245701"
       x2="26.216217"
       y2="52.457001"
       gradientUnits="userSpaceOnUse"
       gradientTransform="matrix(0.5970751,0,0,0.5962124,2.3080274,6.7497525)" />
    <linearGradient
       inkscape:collect="always"
       xlink:href="#linearGradient3263"
       id="linearGradient3277"
       gradientUnits="userSpaceOnUse"
       gradientTransform="matrix(0,0.5962124,-0.5970751,0,62.019205,6.7460915)"
       x1="16.30221"
       y1="50.245701"
       x2="26.461918"
       y2="48.525795" />
    <linearGradient
       inkscape:collect="always"
       xlink:href="#linearGradient3316"
       id="linearGradient3295"
       gradientUnits="userSpaceOnUse"
       x1="5.982801"
       y1="50"
       x2="28.67322"
       y2="52.457001"
       gradientTransform="matrix(-0.5970751,0,0,-0.5962124,62.020674,66.219372)" />
    <linearGradient
       inkscape:collect="always"
       xlink:href="#linearGradient3310"
       id="linearGradient3297"
       gradientUnits="userSpaceOnUse"
       gradientTransform="matrix(0,-0.5962124,0.5970751,0,2.0160933,56.976616)"
       x1="5.982801"
       y1="50"
       x2="25.479116"
       y2="48.280098" />
    <linearGradient
       inkscape:collect="always"
       xlink:href="#linearGradient3322"
       id="linearGradient3299"
       gradientUnits="userSpaceOnUse"
       gradientTransform="matrix(-0.5970751,0,0,-0.5962124,61.727271,66.365861)"
       x1="16.30221"
       y1="50.245701"
       x2="27.690418"
       y2="52.2113" />
    <linearGradient
       inkscape:collect="always"
       xlink:href="#linearGradient3304"
       id="linearGradient3301"
       gradientUnits="userSpaceOnUse"
       gradientTransform="matrix(0,-0.5962124,0.5970751,0,2.0160933,56.830125)"
       x1="16.30221"
       y1="50.245701"
       x2="26.461918"
       y2="48.525795" />
  </defs>
  <sodipodi:namedview
     id="base"
     pagecolor="#ffffff"
     bordercolor="#666666"
     borderopacity="1.0"
     inkscape:pageopacity="0.0"
     inkscape:pageshadow="2"
     inkscape:zoom="2.8284271"
     inkscape:cx="128.15823"
     inkscape:cy="12.420156"
     inkscape:document-units="px"
     inkscape:current-layer="layer1"
     width="64px"
     height="64px"
     inkscape:window-width="896"
     inkscape:window-height="678"
     inkscape:window-x="268"
     inkscape:window-y="126"
     showgrid="true" />
  <metadata
     id="metadata7">
    <rdf:RDF>
      <cc:Work
         rdf:about="">
        <dc:format>image/svg+xml</dc:format>
        <dc:type
           rdf:resource="http://purl.org/dc/dcmitype/StillImage" />
      </cc:Work>
    </rdf:RDF>
  </metadata>
  <g
     inkscape:label="Ebene 1"
     inkscape:groupmode="layer"
     id="layer1">
    <rect
       style="opacity:0.40451511;color:#000000;fill:#000000;fill-opacity:1;fill-rule:evenodd;stroke:none;stroke-width:1;stroke-linecap:butt;stroke-linejoin:round;marker:none;marker-start:none;marker-mid:none;marker-end:none;stroke-miterlimit:4;stroke-dasharray:none;stroke-dashoffset:0;stroke-opacity:1;visibility:visible;display:inline;overflow:visible"
       id="rect3478"
       width="54.616974"
       height="44.862415"
       x="5.754046"
       y="10.637585" />
    <rect
       style="opacity:1;color:#000000;fill:#b3b3b3;fill-opacity:1;fill-rule:evenodd;stroke:none;stroke-width:1;stroke-linecap:butt;stroke-linejoin:round;marker:none;marker-start:none;marker-mid:none;marker-end:none;stroke-miterlimit:4;stroke-dasharray:none;stroke-dashoffset:0;stroke-opacity:1;visibility:visible;display:inline;overflow:visible"
       id="rect2258"
       width="54.616974"
       height="44.862415"
       x="4.559895"
       y="9.4451599" />
    <path
       style="opacity:1;color:#000000;fill:#909090;fill-opacity:1;fill-rule:evenodd;stroke:#646464;stroke-width:1;stroke-linecap:butt;stroke-linejoin:round;marker:none;marker-start:none;marker-mid:none;marker-end:none;stroke-miterlimit:4;stroke-dasharray:none;stroke-dashoffset:0;stroke-opacity:1;visibility:visible;display:inline;overflow:visible"
       d="M 5,9.26246 L 5,54.052917 L 59.109931,54.052917 L 59.109931,9.26246 L 5,9.26246 z M 11.64246,16.118903 L 52.46747,16.118903 L 52.46747,47.196474 L 11.64246,47.196474 L 11.64246,16.118903 z "
       id="rect3737" />
    <path
       style="opacity:1;color:#000000;fill:none;fill-opacity:1;fill-rule:evenodd;stroke:#ffffff;stroke-width:1.00000012;stroke-linecap:butt;stroke-linejoin:round;marker:none;marker-start:none;marker-mid:none;marker-end:none;stroke-miterlimit:4;stroke-dasharray:none;stroke-dashoffset:0;stroke-opacity:0.29351537;visibility:visible;display:inline;overflow:visible"
       d="M 5.6352004,9.789443 L 5.6352004,53.525935 L 58.474733,53.525935 L 58.474733,9.789443 L 5.6352004,9.789443 z M 11.033108,15.535978 L 53.076826,15.535978 L 53.076826,47.91786 L 11.033108,47.91786 L 11.033108,15.535978 z "
       id="path4715"
       sodipodi:nodetypes="cccccccccc" />
    <path
       style="opacity:0.41806024;fill:url(#linearGradient3251);fill-opacity:1;fill-rule:evenodd;stroke:none;stroke-width:1px;stroke-linecap:butt;stroke-linejoin:miter;stroke-opacity:1"
       d="M 5.5868061,9.856795 L 5.5868061,53.595942 L 7.3985697,52.039 L 7.3985697,11.542344 L 5.5868061,9.856795 z "
       id="path2262"
       sodipodi:nodetypes="ccccc" />
    <path
       style="opacity:0.41806024;fill:url(#linearGradient3257);fill-opacity:1;fill-rule:evenodd;stroke:none;stroke-width:1px;stroke-linecap:butt;stroke-linejoin:miter;stroke-opacity:1"
       d="M 57.86022,10.166621 L 5.8042773,10.061224 L 7.2579232,11.536298 L 55.87883,11.536298 L 57.86022,10.166621 z "
       id="path3255"
       sodipodi:nodetypes="ccccc" />
    <path
       style="opacity:0.35785953;fill:url(#linearGradient3269);fill-opacity:1;fill-rule:evenodd;stroke:none;stroke-width:1px;stroke-linecap:butt;stroke-linejoin:miter;stroke-opacity:1"
       d="M 9.6533707,13.783278 L 9.6533707,49.004018 L 11.171732,47.504046 L 11.171732,15.28325 L 9.6533707,13.783278 z "
       id="path3259"
       sodipodi:nodetypes="ccccc" />
    <path
       style="opacity:0.35785953;fill:url(#linearGradient3277);fill-opacity:1;fill-rule:evenodd;stroke:none;stroke-width:1px;stroke-linecap:butt;stroke-linejoin:miter;stroke-opacity:1"
       d="M 54.414647,14.057611 L 9.8339483,13.952214 L 11.124993,15.280799 L 52.912505,15.280799 L 54.414647,14.057611 z "
       id="path3275"
       sodipodi:nodetypes="ccccc" />
    <path
       style="opacity:0.35785953;fill:url(#linearGradient3295);fill-opacity:1;fill-rule:evenodd;stroke:none;stroke-width:1px;stroke-linecap:butt;stroke-linejoin:miter;stroke-opacity:1"
       d="M 58.448492,53.508628 L 58.448492,9.769481 L 56.636729,11.326424 L 56.636729,51.740894 L 58.448492,53.508628 z "
       id="path3281"
       sodipodi:nodetypes="ccccc" />
    <path
       style="opacity:0.35785953;fill:url(#linearGradient3297);fill-opacity:1;fill-rule:evenodd;stroke:none;stroke-width:1px;stroke-linecap:butt;stroke-linejoin:miter;stroke-opacity:1"
       d="M 6.1750786,53.409596 L 58.653217,53.409596 L 56.671826,51.893428 L 8.1564688,51.893428 L 6.1750786,53.409596 z "
       id="path3289"
       sodipodi:nodetypes="ccccc" />
    <path
       style="opacity:0.4147157;fill:url(#linearGradient3299);fill-opacity:1;fill-rule:evenodd;stroke:none;stroke-width:1px;stroke-linecap:butt;stroke-linejoin:miter;stroke-opacity:1"
       d="M 54.381928,49.127496 L 54.381928,14.045217 L 52.863566,15.545188 L 52.863566,47.732921 L 54.381928,49.127496 z "
       id="path3291"
       sodipodi:nodetypes="ccccc" />
    <path
       style="opacity:0.4147157;fill:url(#linearGradient3301);fill-opacity:1;fill-rule:evenodd;stroke:none;stroke-width:1px;stroke-linecap:butt;stroke-linejoin:miter;stroke-opacity:1"
       d="M 9.7262002,49.202417 L 54.551109,49.202417 L 53.048967,47.979228 L 11.228342,47.979228 L 9.7262002,49.202417 z "
       id="path3293"
       sodipodi:nodetypes="ccccc" />
  </g>
</svg>
