<?xml version="1.0" encoding="UTF-8" standalone="no"?>
<!-- Created with Inkscape (http://www.inkscape.org/) -->
<svg
   xmlns:dc="http://purl.org/dc/elements/1.1/"
   xmlns:cc="http://web.resource.org/cc/"
   xmlns:rdf="http://www.w3.org/1999/02/22-rdf-syntax-ns#"
   xmlns:svg="http://www.w3.org/2000/svg"
   xmlns="http://www.w3.org/2000/svg"
   xmlns:xlink="http://www.w3.org/1999/xlink"
   xmlns:sodipodi="http://sodipodi.sourceforge.net/DTD/sodipodi-0.dtd"
   xmlns:inkscape="http://www.inkscape.org/namespaces/inkscape"
   width="100"
   height="100"
   id="svg6299"
   sodipodi:version="0.32"
   inkscape:version="0.45.1"
   sodipodi:docbase="/home/deathcarrot/.screenlets/VolumeControl/themes/dial"
   sodipodi:docname="vol_base.svg"
   inkscape:output_extension="org.inkscape.output.svg.inkscape"
   version="1.0">
  <defs
     id="defs6301">
    <linearGradient
       inkscape:collect="always"
       id="linearGradient10256">
      <stop
         style="stop-color:#000000;stop-opacity:1;"
         offset="0"
         id="stop10258" />
      <stop
         style="stop-color:#000000;stop-opacity:0;"
         offset="1"
         id="stop10260" />
    </linearGradient>
    <linearGradient
       inkscape:collect="always"
       id="linearGradient10241">
      <stop
         style="stop-color:#000000;stop-opacity:1;"
         offset="0"
         id="stop10243" />
      <stop
         style="stop-color:#000000;stop-opacity:0;"
         offset="1"
         id="stop10245" />
    </linearGradient>
    <linearGradient
       id="linearGradient10233">
      <stop
         id="stop10235"
         offset="0"
         style="stop-color:#dbe3e6;stop-opacity:1;" />
      <stop
         id="stop10237"
         offset="1"
         style="stop-color:#8e9ba0;stop-opacity:0;" />
    </linearGradient>
    <linearGradient
       id="linearGradient9254">
      <stop
         id="stop9256"
         offset="0"
         style="stop-color:#70b2cd;stop-opacity:1;" />
      <stop
         id="stop9258"
         offset="1"
         style="stop-color:#556b74;stop-opacity:1;" />
    </linearGradient>
    <linearGradient
       id="linearGradient8254">
      <stop
         style="stop-color:#dbe3e6;stop-opacity:1;"
         offset="0"
         id="stop8256" />
      <stop
         style="stop-color:#8e9ba0;stop-opacity:1;"
         offset="1"
         id="stop8258" />
    </linearGradient>
    <linearGradient
       inkscape:collect="always"
       xlink:href="#linearGradient8254"
       id="linearGradient8260"
       x1="213.5406"
       y1="556.3125"
       x2="595.45941"
       y2="496.3125"
       gradientUnits="userSpaceOnUse"
       gradientTransform="matrix(0.1928327,0,0,0.1928327,124.06664,354.78017)" />
    <radialGradient
       inkscape:collect="always"
       xlink:href="#linearGradient10233"
       id="radialGradient10239"
       cx="314.80618"
       cy="559.17975"
       fx="314.80618"
       fy="559.17969"
       r="190.9594"
       gradientTransform="matrix(-0.3322665,-3.0296266e-3,9.2486904e-4,-0.1014336,306.14987,529.87842)"
       gradientUnits="userSpaceOnUse" />
    <radialGradient
       inkscape:collect="always"
       xlink:href="#linearGradient10241"
       id="radialGradient10247"
       cx="182.66617"
       cy="559.17963"
       fx="182.66617"
       fy="559.17963"
       r="190.9594"
       gradientTransform="matrix(-0.3322665,-3.0295791e-3,9.2485889e-4,-0.1014336,262.24417,529.47806)"
       gradientUnits="userSpaceOnUse" />
    <linearGradient
       inkscape:collect="always"
       xlink:href="#linearGradient10256"
       id="linearGradient10262"
       x1="479"
       y1="671.375"
       x2="694.88379"
       y2="486.375"
       gradientUnits="userSpaceOnUse"
       gradientTransform="matrix(0.1928327,0,0,0.1928327,124.06664,354.78017)" />
  </defs>
  <sodipodi:namedview
     id="base"
     pagecolor="#ffffff"
     bordercolor="#666666"
     borderopacity="1.0"
     gridtolerance="10000"
     guidetolerance="10"
     objecttolerance="10"
     inkscape:pageopacity="0.0"
     inkscape:pageshadow="2"
     inkscape:zoom="4"
     inkscape:cx="56.408011"
     inkscape:cy="49.890877"
     inkscape:document-units="px"
     inkscape:current-layer="layer1"
     inkscape:window-width="922"
     inkscape:window-height="649"
     inkscape:window-x="42"
     inkscape:window-y="28"
     height="100px"
     width="100px" />
  <metadata
     id="metadata6304">
    <rdf:RDF>
      <cc:Work
         rdf:about="">
        <dc:format>image/svg+xml</dc:format>
        <dc:type
           rdf:resource="http://purl.org/dc/dcmitype/StillImage" />
      </cc:Work>
    </rdf:RDF>
  </metadata>
  <g
     inkscape:label="Layer 1"
     inkscape:groupmode="layer"
     id="layer1"
     transform="translate(-152.46733,-414.75936)">
    <path
       id="path6307"
       style="fill:#4a626e;fill-opacity:0.30994153;stroke:#000000;stroke-width:0.19283274;stroke-miterlimit:4;stroke-opacity:1"
       d="M 241.59365,479.10742 L 247.39607,479.96578 C 242.93908,490.87889 217.28682,498.28195 190.13657,496.49045 C 173.76146,495.40994 160.94108,491.60189 153.56375,485.62717 L 163.41161,480.75817 C 168.83823,485.79726 178.37046,489.96859 192.56671,491.1711 C 215.66248,493.12745 236.34922,487.72292 241.59365,479.10742 z "
       sodipodi:nodetypes="ccsccsc" />
    <path
       style="opacity:1;fill:url(#radialGradient10239);fill-opacity:1;stroke:url(#radialGradient10247);stroke-width:0.16512026;stroke-miterlimit:4;stroke-dasharray:none;stroke-opacity:1"
       d="M 238.80815,475.56578 L 229.04599,514.32516 L 175.08898,514.32516 L 165.32682,475.56578 L 238.80815,475.56578 z "
       id="path9260"
       sodipodi:nodetypes="ccccc" />
    <path
       style="opacity:1;fill:url(#linearGradient10262);fill-opacity:1;stroke:none;stroke-width:0.62874252;stroke-miterlimit:4;stroke-dasharray:none;stroke-opacity:1"
       d="M 231.28164,457.05384 L 205.05639,464.18865 L 230.7232,483.92841 C 237.37579,482.20486 251.92105,476.37664 250.19818,468.60135 C 248.48136,460.85338 235.99216,459.58864 231.28164,457.05384 z "
       id="path10249"
       sodipodi:nodetypes="ccczc" />
    <path
       style="opacity:1;fill:url(#linearGradient8260);fill-opacity:1;stroke:#000000;stroke-width:0.16512026;stroke-miterlimit:4;stroke-dasharray:none;stroke-opacity:1"
       d="M 238.80815,475.56578 C 238.80814,468.00063 229.04599,450.46021 229.04599,444.90538 C 229.04599,439.35054 216.95844,434.84191 202.06748,434.84192 C 187.17652,434.84192 175.08897,439.35055 175.08898,444.90538 C 175.08898,450.4602 165.32682,468.00063 165.32682,475.56578 C 165.32682,483.13093 181.78741,489.26896 202.06748,489.26896 C 222.34755,489.26896 238.80815,483.13093 238.80815,475.56578 z "
       id="path6309"
       sodipodi:nodetypes="cccccsc" />
    <path
       sodipodi:type="arc"
       style="opacity:1;fill:#b9c3c7;fill-opacity:1;stroke:#000000;stroke-width:1;stroke-miterlimit:4;stroke-dasharray:none;stroke-opacity:1"
       id="path7280"
       sodipodi:cx="404.5"
       sodipodi:cy="626.36218"
       sodipodi:rx="222.5"
       sodipodi:ry="83"
       d="M 627 626.36218 A 222.5 83 0 1 1  182,626.36218 A 222.5 83 0 1 1  627 626.36218 z"
       transform="matrix(0.1212421,0,0,0.1212421,153.02503,368.96141)" />
  </g>
</svg>
