<?xml version="1.0" encoding="UTF-8" standalone="no"?>
<!-- Created with Inkscape (http://www.inkscape.org/) -->
<svg
   xmlns:dc="http://purl.org/dc/elements/1.1/"
   xmlns:cc="http://web.resource.org/cc/"
   xmlns:rdf="http://www.w3.org/1999/02/22-rdf-syntax-ns#"
   xmlns:svg="http://www.w3.org/2000/svg"
   xmlns="http://www.w3.org/2000/svg"
   xmlns:xlink="http://www.w3.org/1999/xlink"
   xmlns:sodipodi="http://sodipodi.sourceforge.net/DTD/sodipodi-0.dtd"
   xmlns:inkscape="http://www.inkscape.org/namespaces/inkscape"
   width="64px"
   height="64px"
   id="svg2178"
   sodipodi:version="0.32"
   inkscape:version="0.45"
   sodipodi:docbase="/home/ryx/Documents/scripts/python/screenlets/screenlets-0.0.10/src/share/screenlets/Windowlist"
   sodipodi:docname="icon.svg"
   inkscape:output_extension="org.inkscape.output.svg.inkscape"
   sodipodi:modified="true">
  <defs
     id="defs2180">
    <linearGradient
       id="linearGradient3398">
      <stop
         style="stop-color:#e6b798;stop-opacity:1;"
         offset="0"
         id="stop3400" />
      <stop
         style="stop-color:#ffffff;stop-opacity:1;"
         offset="1"
         id="stop3402" />
    </linearGradient>
    <linearGradient
       id="linearGradient3346">
      <stop
         id="stop3348"
         offset="0"
         style="stop-color:#b8e698;stop-opacity:1;" />
      <stop
         id="stop3350"
         offset="1"
         style="stop-color:#ffffff;stop-opacity:1;" />
    </linearGradient>
    <linearGradient
       id="linearGradient3209">
      <stop
         style="stop-color:#b1b1b1;stop-opacity:1;"
         offset="0"
         id="stop3211" />
      <stop
         style="stop-color:#ffffff;stop-opacity:1;"
         offset="1"
         id="stop3213" />
    </linearGradient>
    <linearGradient
       inkscape:collect="always"
       xlink:href="#linearGradient3209"
       id="linearGradient3317"
       gradientUnits="userSpaceOnUse"
       gradientTransform="matrix(0.9478555,0,0,0.9222266,1.3036117,1.2577422)"
       x1="2.5033016"
       y1="-1.5971668"
       x2="11.644118"
       y2="24.663275" />
    <linearGradient
       inkscape:collect="always"
       xlink:href="#linearGradient3209"
       id="linearGradient3321"
       gradientUnits="userSpaceOnUse"
       x1="12.70516"
       y1="4"
       x2="34.77887"
       y2="43.687962" />
    <linearGradient
       inkscape:collect="always"
       xlink:href="#linearGradient3346"
       id="linearGradient3342"
       gradientUnits="userSpaceOnUse"
       x1="12.70516"
       y1="4"
       x2="34.77887"
       y2="43.687962"
       gradientTransform="translate(6,10)" />
    <linearGradient
       inkscape:collect="always"
       xlink:href="#linearGradient3209"
       id="linearGradient3344"
       gradientUnits="userSpaceOnUse"
       gradientTransform="matrix(0.9478555,0,0,0.9222266,7.303612,11.257742)"
       x1="2.5033016"
       y1="-1.5971668"
       x2="11.644118"
       y2="24.663275" />
    <linearGradient
       inkscape:collect="always"
       xlink:href="#linearGradient3398"
       id="linearGradient3394"
       gradientUnits="userSpaceOnUse"
       gradientTransform="translate(12,20)"
       x1="12.70516"
       y1="4"
       x2="34.77887"
       y2="43.687962" />
    <linearGradient
       inkscape:collect="always"
       xlink:href="#linearGradient3209"
       id="linearGradient3396"
       gradientUnits="userSpaceOnUse"
       gradientTransform="matrix(0.9478555,0,0,0.9222266,13.303612,21.257742)"
       x1="2.5033016"
       y1="-1.5971668"
       x2="11.644118"
       y2="24.663275" />
    <linearGradient
       inkscape:collect="always"
       xlink:href="#linearGradient3209"
       id="linearGradient3410"
       gradientUnits="userSpaceOnUse"
       gradientTransform="matrix(0.9395509,0,0,0.8902628,1.5112263,2.602782)"
       x1="2.5033016"
       y1="-1.5971668"
       x2="11.644118"
       y2="24.663275" />
    <linearGradient
       inkscape:collect="always"
       xlink:href="#linearGradient3209"
       id="linearGradient3414"
       gradientUnits="userSpaceOnUse"
       x1="12.70516"
       y1="4"
       x2="34.77887"
       y2="43.687962" />
    <linearGradient
       inkscape:collect="always"
       xlink:href="#linearGradient3209"
       id="linearGradient3448"
       gradientUnits="userSpaceOnUse"
       x1="12.70516"
       y1="4"
       x2="34.77887"
       y2="43.687962" />
    <linearGradient
       inkscape:collect="always"
       xlink:href="#linearGradient3209"
       id="linearGradient3450"
       gradientUnits="userSpaceOnUse"
       gradientTransform="matrix(0.9395509,0,0,0.8902628,1.5112263,2.602782)"
       x1="2.5033016"
       y1="-1.5971668"
       x2="11.644118"
       y2="24.663275" />
    <linearGradient
       inkscape:collect="always"
       xlink:href="#linearGradient3209"
       id="linearGradient3472"
       gradientUnits="userSpaceOnUse"
       x1="12.70516"
       y1="4"
       x2="34.77887"
       y2="43.687962" />
    <linearGradient
       inkscape:collect="always"
       xlink:href="#linearGradient3209"
       id="linearGradient3474"
       gradientUnits="userSpaceOnUse"
       gradientTransform="matrix(0.9395509,0,0,0.8902628,1.5112263,2.602782)"
       x1="2.5033016"
       y1="-1.5971668"
       x2="11.644118"
       y2="24.663275" />
    <linearGradient
       inkscape:collect="always"
       xlink:href="#linearGradient3209"
       id="linearGradient3476"
       gradientUnits="userSpaceOnUse"
       x1="12.70516"
       y1="4"
       x2="34.77887"
       y2="43.687962" />
    <linearGradient
       inkscape:collect="always"
       xlink:href="#linearGradient3209"
       id="linearGradient3478"
       gradientUnits="userSpaceOnUse"
       gradientTransform="matrix(0.9395509,0,0,0.8902628,1.5112263,2.602782)"
       x1="2.5033016"
       y1="-1.5971668"
       x2="11.644118"
       y2="24.663275" />
    <linearGradient
       inkscape:collect="always"
       xlink:href="#linearGradient3209"
       id="linearGradient3486"
       gradientUnits="userSpaceOnUse"
       gradientTransform="matrix(0.9395509,0,0,0.8902628,1.5112263,2.602782)"
       x1="2.5033016"
       y1="-1.5971668"
       x2="11.644118"
       y2="24.663275" />
    <linearGradient
       inkscape:collect="always"
       xlink:href="#linearGradient3209"
       id="linearGradient3490"
       gradientUnits="userSpaceOnUse"
       x1="12.70516"
       y1="4"
       x2="34.77887"
       y2="43.687962" />
    <linearGradient
       inkscape:collect="always"
       xlink:href="#linearGradient3209"
       id="linearGradient3504"
       gradientUnits="userSpaceOnUse"
       x1="12.70516"
       y1="4"
       x2="34.77887"
       y2="43.687962" />
    <linearGradient
       inkscape:collect="always"
       xlink:href="#linearGradient3209"
       id="linearGradient3506"
       gradientUnits="userSpaceOnUse"
       gradientTransform="matrix(0.9395509,0,0,0.8902628,1.5112263,2.602782)"
       x1="2.5033016"
       y1="-1.5971668"
       x2="11.644118"
       y2="24.663275" />
    <linearGradient
       inkscape:collect="always"
       xlink:href="#linearGradient3209"
       id="linearGradient3539"
       gradientUnits="userSpaceOnUse"
       x1="12.70516"
       y1="4"
       x2="34.77887"
       y2="43.687962" />
    <linearGradient
       inkscape:collect="always"
       xlink:href="#linearGradient3209"
       id="linearGradient3541"
       gradientUnits="userSpaceOnUse"
       gradientTransform="matrix(0.9395509,0,0,0.8902628,1.5112263,2.602782)"
       x1="2.5033016"
       y1="-1.5971668"
       x2="11.644118"
       y2="24.663275" />
    <linearGradient
       inkscape:collect="always"
       xlink:href="#linearGradient3209"
       id="linearGradient3563"
       gradientUnits="userSpaceOnUse"
       x1="12.70516"
       y1="4"
       x2="34.77887"
       y2="43.687962" />
    <linearGradient
       inkscape:collect="always"
       xlink:href="#linearGradient3209"
       id="linearGradient3565"
       gradientUnits="userSpaceOnUse"
       gradientTransform="matrix(0.9395509,0,0,0.8902628,1.5112263,2.602782)"
       x1="2.5033016"
       y1="-1.5971668"
       x2="11.644118"
       y2="24.663275" />
  </defs>
  <sodipodi:namedview
     id="base"
     pagecolor="#ffffff"
     bordercolor="#666666"
     borderopacity="1.0"
     inkscape:pageopacity="0.0"
     inkscape:pageshadow="2"
     inkscape:zoom="6.359375"
     inkscape:cx="32"
     inkscape:cy="32"
     inkscape:current-layer="layer1"
     showgrid="true"
     inkscape:document-units="px"
     inkscape:grid-bbox="true"
     inkscape:window-width="896"
     inkscape:window-height="626"
     inkscape:window-x="272"
     inkscape:window-y="161" />
  <metadata
     id="metadata2183">
    <rdf:RDF>
      <cc:Work
         rdf:about="">
        <dc:format>image/svg+xml</dc:format>
        <dc:type
           rdf:resource="http://purl.org/dc/dcmitype/StillImage" />
      </cc:Work>
    </rdf:RDF>
  </metadata>
  <g
     id="layer1"
     inkscape:label="Layer 1"
     inkscape:groupmode="layer">
    <g
       id="g3493">
      <rect
         y="7"
         x="7"
         height="29"
         width="40"
         id="rect2220"
         style="color:#000000;fill:#000000;fill-opacity:0.23890782;fill-rule:evenodd;stroke:none;stroke-width:0.30000001;stroke-linecap:butt;stroke-linejoin:miter;marker:none;marker-start:none;marker-mid:none;marker-end:none;stroke-miterlimit:4;stroke-dasharray:none;stroke-dashoffset:0;stroke-opacity:1;visibility:visible;display:inline;overflow:visible" />
      <rect
         y="4.5"
         x="5.5"
         height="29"
         width="39"
         id="rect2186"
         style="color:#000000;fill:url(#linearGradient3504);fill-opacity:1;fill-rule:evenodd;stroke:#555555;stroke-width:1;stroke-linecap:butt;stroke-linejoin:miter;marker:none;marker-start:none;marker-mid:none;marker-end:none;stroke-miterlimit:4;stroke-dasharray:none;stroke-dashoffset:0;stroke-opacity:1;visibility:visible;display:inline;overflow:visible" />
      <rect
         y="6.5"
         x="7.5"
         height="25"
         width="35"
         id="rect3244"
         style="color:#000000;fill:none;fill-opacity:1;fill-rule:evenodd;stroke:#9d9d9d;stroke-width:0.99999994;stroke-linecap:butt;stroke-linejoin:miter;marker:none;marker-start:none;marker-mid:none;marker-end:none;stroke-miterlimit:4;stroke-dasharray:none;stroke-dashoffset:0;stroke-opacity:1;visibility:visible;display:inline;overflow:visible" />
      <path
         id="rect3193"
         d="M 8,8 L 8,26 C 16.022262,18.727244 28.102381,13.562747 42,12.034003 L 42,8 L 8,8 z "
         style="opacity:0.51505019;color:#000000;fill:url(#linearGradient3506);fill-opacity:1;fill-rule:evenodd;stroke:none;stroke-width:1;stroke-linecap:butt;stroke-linejoin:miter;marker:none;marker-start:none;marker-mid:none;marker-end:none;stroke-miterlimit:4;stroke-dasharray:none;stroke-dashoffset:0;stroke-opacity:1;visibility:visible;display:inline;overflow:visible" />
      <rect
         y="6"
         x="7"
         height="4"
         width="36"
         id="rect3226"
         style="color:#000000;fill:#808080;fill-opacity:1;fill-rule:evenodd;stroke:none;stroke-width:1;stroke-linecap:butt;stroke-linejoin:miter;marker:none;marker-start:none;marker-mid:none;marker-end:none;stroke-miterlimit:4;stroke-dasharray:none;stroke-dashoffset:0;stroke-opacity:1;visibility:visible;display:inline;overflow:visible" />
      <rect
         y="7"
         x="40"
         height="2"
         width="2"
         id="rect3228"
         style="color:#000000;fill:#cccccc;fill-opacity:1;fill-rule:evenodd;stroke:none;stroke-width:1;stroke-linecap:butt;stroke-linejoin:miter;marker:none;marker-start:none;marker-mid:none;marker-end:none;stroke-miterlimit:4;stroke-dasharray:none;stroke-dashoffset:0;stroke-opacity:1;visibility:visible;display:inline;overflow:visible" />
      <rect
         y="7"
         x="37"
         height="2"
         width="2"
         id="rect3230"
         style="color:#000000;fill:#cccccc;fill-opacity:1;fill-rule:evenodd;stroke:none;stroke-width:1;stroke-linecap:butt;stroke-linejoin:miter;marker:none;marker-start:none;marker-mid:none;marker-end:none;stroke-miterlimit:4;stroke-dasharray:none;stroke-dashoffset:0;stroke-opacity:1;visibility:visible;display:inline;overflow:visible" />
      <rect
         y="7"
         x="34"
         height="2"
         width="2"
         id="rect3232"
         style="color:#000000;fill:#cccccc;fill-opacity:1;fill-rule:evenodd;stroke:none;stroke-width:1;stroke-linecap:butt;stroke-linejoin:miter;marker:none;marker-start:none;marker-mid:none;marker-end:none;stroke-miterlimit:4;stroke-dasharray:none;stroke-dashoffset:0;stroke-opacity:1;visibility:visible;display:inline;overflow:visible" />
      <rect
         y="7"
         x="8"
         height="2"
         width="2"
         id="rect3234"
         style="color:#000000;fill:#cccccc;fill-opacity:1;fill-rule:evenodd;stroke:none;stroke-width:1;stroke-linecap:butt;stroke-linejoin:miter;marker:none;marker-start:none;marker-mid:none;marker-end:none;stroke-miterlimit:4;stroke-dasharray:none;stroke-dashoffset:0;stroke-opacity:1;visibility:visible;display:inline;overflow:visible" />
    </g>
    <g
       id="g3428"
       transform="translate(8,10)">
      <rect
         y="7"
         x="7"
         height="29"
         width="40"
         id="rect3430"
         style="color:#000000;fill:#000000;fill-opacity:0.23890782;fill-rule:evenodd;stroke:none;stroke-width:0.30000001;stroke-linecap:butt;stroke-linejoin:miter;marker:none;marker-start:none;marker-mid:none;marker-end:none;stroke-miterlimit:4;stroke-dasharray:none;stroke-dashoffset:0;stroke-opacity:1;visibility:visible;display:inline;overflow:visible" />
      <rect
         y="4.5"
         x="5.5"
         height="29"
         width="39"
         id="rect3432"
         style="color:#000000;fill:url(#linearGradient3539);fill-opacity:1;fill-rule:evenodd;stroke:#555555;stroke-width:1;stroke-linecap:butt;stroke-linejoin:miter;marker:none;marker-start:none;marker-mid:none;marker-end:none;stroke-miterlimit:4;stroke-dasharray:none;stroke-dashoffset:0;stroke-opacity:1;visibility:visible;display:inline;overflow:visible" />
      <rect
         y="6.5"
         x="7.5"
         height="25"
         width="35"
         id="rect3434"
         style="color:#000000;fill:none;fill-opacity:1;fill-rule:evenodd;stroke:#9d9d9d;stroke-width:0.99999994;stroke-linecap:butt;stroke-linejoin:miter;marker:none;marker-start:none;marker-mid:none;marker-end:none;stroke-miterlimit:4;stroke-dasharray:none;stroke-dashoffset:0;stroke-opacity:1;visibility:visible;display:inline;overflow:visible" />
      <path
         id="path3436"
         d="M 8,8 L 8,26 C 16.022262,18.727244 28.102381,13.562747 42,12.034003 L 42,8 L 8,8 z "
         style="opacity:0.51505019;color:#000000;fill:url(#linearGradient3541);fill-opacity:1;fill-rule:evenodd;stroke:none;stroke-width:1;stroke-linecap:butt;stroke-linejoin:miter;marker:none;marker-start:none;marker-mid:none;marker-end:none;stroke-miterlimit:4;stroke-dasharray:none;stroke-dashoffset:0;stroke-opacity:1;visibility:visible;display:inline;overflow:visible" />
      <rect
         y="6"
         x="7"
         height="4"
         width="36"
         id="rect3438"
         style="color:#000000;fill:#808080;fill-opacity:1;fill-rule:evenodd;stroke:none;stroke-width:1;stroke-linecap:butt;stroke-linejoin:miter;marker:none;marker-start:none;marker-mid:none;marker-end:none;stroke-miterlimit:4;stroke-dasharray:none;stroke-dashoffset:0;stroke-opacity:1;visibility:visible;display:inline;overflow:visible" />
      <rect
         y="7"
         x="40"
         height="2"
         width="2"
         id="rect3440"
         style="color:#000000;fill:#cccccc;fill-opacity:1;fill-rule:evenodd;stroke:none;stroke-width:1;stroke-linecap:butt;stroke-linejoin:miter;marker:none;marker-start:none;marker-mid:none;marker-end:none;stroke-miterlimit:4;stroke-dasharray:none;stroke-dashoffset:0;stroke-opacity:1;visibility:visible;display:inline;overflow:visible" />
      <rect
         y="7"
         x="37"
         height="2"
         width="2"
         id="rect3442"
         style="color:#000000;fill:#cccccc;fill-opacity:1;fill-rule:evenodd;stroke:none;stroke-width:1;stroke-linecap:butt;stroke-linejoin:miter;marker:none;marker-start:none;marker-mid:none;marker-end:none;stroke-miterlimit:4;stroke-dasharray:none;stroke-dashoffset:0;stroke-opacity:1;visibility:visible;display:inline;overflow:visible" />
      <rect
         y="7"
         x="34"
         height="2"
         width="2"
         id="rect3444"
         style="color:#000000;fill:#cccccc;fill-opacity:1;fill-rule:evenodd;stroke:none;stroke-width:1;stroke-linecap:butt;stroke-linejoin:miter;marker:none;marker-start:none;marker-mid:none;marker-end:none;stroke-miterlimit:4;stroke-dasharray:none;stroke-dashoffset:0;stroke-opacity:1;visibility:visible;display:inline;overflow:visible" />
      <rect
         y="7"
         x="8"
         height="2"
         width="2"
         id="rect3446"
         style="color:#000000;fill:#cccccc;fill-opacity:1;fill-rule:evenodd;stroke:none;stroke-width:1;stroke-linecap:butt;stroke-linejoin:miter;marker:none;marker-start:none;marker-mid:none;marker-end:none;stroke-miterlimit:4;stroke-dasharray:none;stroke-dashoffset:0;stroke-opacity:1;visibility:visible;display:inline;overflow:visible" />
    </g>
    <g
       id="g3543"
       transform="translate(16,20)">
      <rect
         y="7"
         x="7"
         height="29"
         width="40"
         id="rect3545"
         style="color:#000000;fill:#000000;fill-opacity:0.23890782;fill-rule:evenodd;stroke:none;stroke-width:0.30000001;stroke-linecap:butt;stroke-linejoin:miter;marker:none;marker-start:none;marker-mid:none;marker-end:none;stroke-miterlimit:4;stroke-dasharray:none;stroke-dashoffset:0;stroke-opacity:1;visibility:visible;display:inline;overflow:visible" />
      <rect
         y="4.5"
         x="5.5"
         height="29"
         width="39"
         id="rect3547"
         style="color:#000000;fill:url(#linearGradient3563);fill-opacity:1;fill-rule:evenodd;stroke:#555555;stroke-width:1;stroke-linecap:butt;stroke-linejoin:miter;marker:none;marker-start:none;marker-mid:none;marker-end:none;stroke-miterlimit:4;stroke-dasharray:none;stroke-dashoffset:0;stroke-opacity:1;visibility:visible;display:inline;overflow:visible" />
      <rect
         y="6.5"
         x="7.5"
         height="25"
         width="35"
         id="rect3549"
         style="color:#000000;fill:none;fill-opacity:1;fill-rule:evenodd;stroke:#9d9d9d;stroke-width:0.99999994;stroke-linecap:butt;stroke-linejoin:miter;marker:none;marker-start:none;marker-mid:none;marker-end:none;stroke-miterlimit:4;stroke-dasharray:none;stroke-dashoffset:0;stroke-opacity:1;visibility:visible;display:inline;overflow:visible" />
      <path
         id="path3551"
         d="M 8,8 L 8,26 C 16.022262,18.727244 28.102381,13.562747 42,12.034003 L 42,8 L 8,8 z "
         style="opacity:0.51505019;color:#000000;fill:url(#linearGradient3565);fill-opacity:1;fill-rule:evenodd;stroke:none;stroke-width:1;stroke-linecap:butt;stroke-linejoin:miter;marker:none;marker-start:none;marker-mid:none;marker-end:none;stroke-miterlimit:4;stroke-dasharray:none;stroke-dashoffset:0;stroke-opacity:1;visibility:visible;display:inline;overflow:visible" />
      <rect
         y="6"
         x="7"
         height="4"
         width="36"
         id="rect3553"
         style="color:#000000;fill:#808080;fill-opacity:1;fill-rule:evenodd;stroke:none;stroke-width:1;stroke-linecap:butt;stroke-linejoin:miter;marker:none;marker-start:none;marker-mid:none;marker-end:none;stroke-miterlimit:4;stroke-dasharray:none;stroke-dashoffset:0;stroke-opacity:1;visibility:visible;display:inline;overflow:visible" />
      <rect
         y="7"
         x="40"
         height="2"
         width="2"
         id="rect3555"
         style="color:#000000;fill:#cccccc;fill-opacity:1;fill-rule:evenodd;stroke:none;stroke-width:1;stroke-linecap:butt;stroke-linejoin:miter;marker:none;marker-start:none;marker-mid:none;marker-end:none;stroke-miterlimit:4;stroke-dasharray:none;stroke-dashoffset:0;stroke-opacity:1;visibility:visible;display:inline;overflow:visible" />
      <rect
         y="7"
         x="37"
         height="2"
         width="2"
         id="rect3557"
         style="color:#000000;fill:#cccccc;fill-opacity:1;fill-rule:evenodd;stroke:none;stroke-width:1;stroke-linecap:butt;stroke-linejoin:miter;marker:none;marker-start:none;marker-mid:none;marker-end:none;stroke-miterlimit:4;stroke-dasharray:none;stroke-dashoffset:0;stroke-opacity:1;visibility:visible;display:inline;overflow:visible" />
      <rect
         y="7"
         x="34"
         height="2"
         width="2"
         id="rect3559"
         style="color:#000000;fill:#cccccc;fill-opacity:1;fill-rule:evenodd;stroke:none;stroke-width:1;stroke-linecap:butt;stroke-linejoin:miter;marker:none;marker-start:none;marker-mid:none;marker-end:none;stroke-miterlimit:4;stroke-dasharray:none;stroke-dashoffset:0;stroke-opacity:1;visibility:visible;display:inline;overflow:visible" />
      <rect
         y="7"
         x="8"
         height="2"
         width="2"
         id="rect3561"
         style="color:#000000;fill:#cccccc;fill-opacity:1;fill-rule:evenodd;stroke:none;stroke-width:1;stroke-linecap:butt;stroke-linejoin:miter;marker:none;marker-start:none;marker-mid:none;marker-end:none;stroke-miterlimit:4;stroke-dasharray:none;stroke-dashoffset:0;stroke-opacity:1;visibility:visible;display:inline;overflow:visible" />
    </g>
  </g>
</svg>
