<?xml version="1.0" encoding="UTF-8" standalone="no"?>
<!-- Created with Inkscape (http://www.inkscape.org/) -->
<svg
   xmlns:dc="http://purl.org/dc/elements/1.1/"
   xmlns:cc="http://web.resource.org/cc/"
   xmlns:rdf="http://www.w3.org/1999/02/22-rdf-syntax-ns#"
   xmlns:svg="http://www.w3.org/2000/svg"
   xmlns="http://www.w3.org/2000/svg"
   xmlns:sodipodi="http://sodipodi.sourceforge.net/DTD/sodipodi-0.dtd"
   xmlns:inkscape="http://www.inkscape.org/namespaces/inkscape"
   width="100"
   height="100"
   id="svg2"
   sodipodi:version="0.32"
   inkscape:version="0.45"
   version="1.0"
   sodipodi:docname="down2.svg"
   sodipodi:docbase="/home/nomego/.screenlets/Stocks/themes/default"
   inkscape:output_extension="org.inkscape.output.svg.inkscape"
   sodipodi:modified="true">
  <defs
     id="defs4" />
  <sodipodi:namedview
     id="base"
     pagecolor="#ffffff"
     bordercolor="#666666"
     borderopacity="1.0"
     gridtolerance="10000"
     guidetolerance="10"
     objecttolerance="10"
     inkscape:pageopacity="0.0"
     inkscape:pageshadow="2"
     inkscape:zoom="1.0610016"
     inkscape:cx="168.86968"
     inkscape:cy="102.92744"
     inkscape:document-units="px"
     inkscape:current-layer="layer1"
     width="100px"
     height="100px"
     inkscape:window-width="910"
     inkscape:window-height="626"
     inkscape:window-x="290"
     inkscape:window-y="229" />
  <metadata
     id="metadata7">
    <rdf:RDF>
      <cc:Work
         rdf:about="">
        <dc:format>image/svg+xml</dc:format>
        <dc:type
           rdf:resource="http://purl.org/dc/dcmitype/StillImage" />
      </cc:Work>
    </rdf:RDF>
  </metadata>
  <g
     inkscape:label="Layer 1"
     inkscape:groupmode="layer"
     id="layer1">
    <g
       id="g7176"
       style="fill:#ffffff;fill-opacity:1;stroke:#fffcfc;stroke-opacity:1">
      <rect
         inkscape:transform-center-y="-162.62067"
         inkscape:transform-center-x="-93.25606"
         transform="matrix(-0.999937,1.1224071e-2,-0.468765,0.8833229,0,0)"
         ry="6.4836493"
         rx="3.1130369"
         y="49.369003"
         x="-106.55186"
         height="23.262917"
         width="72.290451"
         id="rect2168"
         style="fill:#ffffff;fill-opacity:1;fill-rule:nonzero;stroke:#fffcfc;stroke-width:2.88213801;stroke-linecap:butt;stroke-linejoin:miter;stroke-miterlimit:0;stroke-dasharray:none;stroke-opacity:1" />
      <path
         id="path2170"
         d="M 71.568766,35.680934 L 98.054431,53.230269 L 71.9994,69.250304 L 71.568766,35.680934 z "
         style="fill:#ffffff;fill-opacity:1;fill-rule:evenodd;stroke:#fffcfc;stroke-width:3.5207231;stroke-linecap:round;stroke-linejoin:round;stroke-miterlimit:4;stroke-dasharray:none;stroke-opacity:1" />
    </g>
  </g>
</svg>
