<?xml version="1.0" encoding="UTF-8" standalone="no"?>
<!-- Created with Inkscape (http://www.inkscape.org/) -->
<svg
   xmlns:dc="http://purl.org/dc/elements/1.1/"
   xmlns:cc="http://web.resource.org/cc/"
   xmlns:rdf="http://www.w3.org/1999/02/22-rdf-syntax-ns#"
   xmlns:svg="http://www.w3.org/2000/svg"
   xmlns="http://www.w3.org/2000/svg"
   xmlns:xlink="http://www.w3.org/1999/xlink"
   xmlns:sodipodi="http://sodipodi.sourceforge.net/DTD/sodipodi-0.dtd"
   xmlns:inkscape="http://www.inkscape.org/namespaces/inkscape"
   width="100"
   height="100"
   id="svg2"
   sodipodi:version="0.32"
   inkscape:version="0.45.1"
   version="1.0"
   sodipodi:docbase="/home/helder/screenlets/src/share/screenlets/Pager"
   sodipodi:docname="icon.svg"
   inkscape:output_extension="org.inkscape.output.svg.inkscape">
  <defs
     id="defs4">
    <linearGradient
       id="linearGradient4576">
      <stop
         style="stop-color:black;stop-opacity:0.74509805;"
         offset="0"
         id="stop4578" />
      <stop
         style="stop-color:#494949;stop-opacity:0.74509805;"
         offset="1"
         id="stop4580" />
    </linearGradient>
    <linearGradient
       id="linearGradient4568">
      <stop
         style="stop-color:black;stop-opacity:0.2699115;"
         offset="0"
         id="stop4570" />
      <stop
         style="stop-color:black;stop-opacity:0;"
         offset="1"
         id="stop4572" />
    </linearGradient>
    <linearGradient
       id="linearGradient4555">
      <stop
         style="stop-color:white;stop-opacity:0.78318584;"
         offset="0"
         id="stop4557" />
      <stop
         style="stop-color:white;stop-opacity:0;"
         offset="1"
         id="stop4559" />
    </linearGradient>
    <linearGradient
       inkscape:collect="always"
       xlink:href="#linearGradient4576"
       id="linearGradient4582"
       x1="62.892548"
       y1="88.625389"
       x2="40.892548"
       y2="1.1597052"
       gradientUnits="userSpaceOnUse" />
  </defs>
  <sodipodi:namedview
     id="base"
     pagecolor="#ffffff"
     bordercolor="#666666"
     borderopacity="1.0"
     inkscape:pageopacity="0.0"
     inkscape:pageshadow="2"
     inkscape:zoom="1"
     inkscape:cx="72.83174"
     inkscape:cy="32.520611"
     inkscape:document-units="px"
     inkscape:current-layer="layer1"
     width="100px"
     height="100px"
     inkscape:window-width="989"
     inkscape:window-height="624"
     inkscape:window-x="38"
     inkscape:window-y="50" />
  <metadata
     id="metadata7">
    <rdf:RDF>
      <cc:Work
         rdf:about="">
        <dc:format>image/svg+xml</dc:format>
        <dc:type
           rdf:resource="http://purl.org/dc/dcmitype/StillImage" />
      </cc:Work>
    </rdf:RDF>
  </metadata>
  <g
     inkscape:label="Ebene 1"
     inkscape:groupmode="layer"
     id="layer1">
    <rect
       style="opacity:1;color:black;fill:black;fill-opacity:0.23549488;fill-rule:evenodd;stroke:none;stroke-width:2;stroke-linecap:butt;stroke-linejoin:miter;marker:none;marker-start:none;marker-mid:none;marker-end:none;stroke-miterlimit:4;stroke-dasharray:none;stroke-dashoffset:0;stroke-opacity:1;visibility:visible;display:inline;overflow:visible"
       id="rect1872"
       width="93.465683"
       height="93.465683"
       x="5.3058124"
       y="5.3058124"
       rx="4"
       ry="4" />
    <rect
       style="opacity:1;color:black;fill:url(#linearGradient4582);fill-opacity:1.0;fill-rule:evenodd;stroke:none;stroke-width:2;stroke-linecap:butt;stroke-linejoin:miter;marker:none;marker-start:none;marker-mid:none;marker-end:none;stroke-miterlimit:4;stroke-dasharray:none;stroke-dashoffset:0;stroke-opacity:1;visibility:visible;display:inline;overflow:visible"
       id="rect2778"
       width="93.465683"
       height="93.465683"
       x="1.1597052"
       y="1.1597052"
       rx="4"
       ry="4" />
    <rect
       style="opacity:1;fill:#e6e6e6;stroke-width:1;stroke-miterlimit:4;stroke-dasharray:none"
       id="rect2169"
       width="30"
       height="22"
       x="11"
       y="13"
       rx="9.93748"
       ry="0" />
    <rect
       style="opacity:1;fill:#e6e6e6;stroke-width:1;stroke-miterlimit:4;stroke-dasharray:none;fill-opacity:0.70943397"
       id="rect2171"
       width="35"
       height="23"
       x="55"
       y="53"
       rx="9.93748"
       ry="0" />
  </g>
</svg>
