<?xml version="1.0" encoding="UTF-8" standalone="no"?>
<!-- Created with Inkscape (http://www.inkscape.org/) -->
<svg
   xmlns:dc="http://purl.org/dc/elements/1.1/"
   xmlns:cc="http://web.resource.org/cc/"
   xmlns:rdf="http://www.w3.org/1999/02/22-rdf-syntax-ns#"
   xmlns:svg="http://www.w3.org/2000/svg"
   xmlns="http://www.w3.org/2000/svg"
   xmlns:xlink="http://www.w3.org/1999/xlink"
   xmlns:sodipodi="http://sodipodi.sourceforge.net/DTD/sodipodi-0.dtd"
   xmlns:inkscape="http://www.inkscape.org/namespaces/inkscape"
   width="98"
   height="50"
   id="svg2"
   sodipodi:version="0.32"
   inkscape:version="0.45"
   version="1.0"
   sodipodi:docbase="/home/nsierro/.screenlets/ACPIBattery/themes/default"
   sodipodi:docname="acpibattery-battery.svg"
   inkscape:output_extension="org.inkscape.output.svg.inkscape"
   sodipodi:modified="true">
  <defs
     id="defs4">
    <linearGradient
       id="linearGradient2805">
      <stop
         style="stop-color:black;stop-opacity:1;"
         offset="0"
         id="stop2807" />
      <stop
         style="stop-color:black;stop-opacity:0;"
         offset="1"
         id="stop2809" />
    </linearGradient>
    <linearGradient
       inkscape:collect="always"
       id="linearGradient2776">
      <stop
         style="stop-color:white;stop-opacity:1;"
         offset="0"
         id="stop2778" />
      <stop
         style="stop-color:white;stop-opacity:0;"
         offset="1"
         id="stop2780" />
    </linearGradient>
    <linearGradient
       id="linearGradient2760">
      <stop
         style="stop-color:#ff1f1f;stop-opacity:0.75663716;"
         offset="0"
         id="stop2762" />
      <stop
         style="stop-color:#cb0000;stop-opacity:0.80973452;"
         offset="1"
         id="stop2764" />
    </linearGradient>
    <linearGradient
       inkscape:collect="always"
       xlink:href="#linearGradient2776"
       id="linearGradient2782"
       x1="35.784313"
       y1="9.5986519"
       x2="36.764706"
       y2="49.549633"
       gradientUnits="userSpaceOnUse" />
    <linearGradient
       inkscape:collect="always"
       xlink:href="#linearGradient2805"
       id="linearGradient2811"
       x1="55.137867"
       y1="106.66622"
       x2="55.155025"
       y2="68.967857"
       gradientUnits="userSpaceOnUse"
       gradientTransform="matrix(0.942544,0,0,0.921824,2.781224,4.166134)" />
    <linearGradient
       y2="129.34454"
       x2="71.528184"
       y1="150.48783"
       x1="49.75035"
       id="linearGradient1875"
       xlink:href="#linearGradient1864"
       inkscape:collect="always"
       gradientTransform="scale(1.0123027,0.9878468)"
       gradientUnits="userSpaceOnUse" />
    <linearGradient
       y2="21.841769"
       x2="33.89451"
       y1="19.488885"
       x1="36.909282"
       id="linearGradient1872"
       xlink:href="#linearGradient1864"
       inkscape:collect="always"
       gradientTransform="scale(1.684253,0.593735)"
       gradientUnits="userSpaceOnUse" />
    <linearGradient
       y2="17.524179"
       x2="54.972651"
       y1="6.3908208"
       x1="70.862513"
       id="linearGradient1871"
       xlink:href="#linearGradient1864"
       inkscape:collect="always"
       gradientTransform="scale(1.2654625,0.7902249)"
       gradientUnits="userSpaceOnUse" />
    <linearGradient
       y2="20.89794"
       x2="65.888471"
       y1="23.480421"
       x1="60.063359"
       id="linearGradient1899"
       xlink:href="#linearGradient1874"
       inkscape:collect="always"
       gradientTransform="scale(1.1062026,0.9039935)"
       gradientUnits="userSpaceOnUse" />
    <linearGradient
       y2="33.451355"
       x2="44.079405"
       y1="37.148447"
       x1="40.244443"
       id="linearGradient1897"
       xlink:href="#linearGradient1864"
       inkscape:collect="always"
       gradientTransform="scale(1.5060779,0.6639763)"
       gradientUnits="userSpaceOnUse" />
    <linearGradient
       y2="29.25222"
       x2="38.929003"
       y1="31.992172"
       x1="35.220662"
       id="linearGradient1895"
       xlink:href="#linearGradient1864"
       inkscape:collect="always"
       gradientTransform="scale(1.6994649,0.5884205)"
       gradientUnits="userSpaceOnUse" />
    <linearGradient
       y2="38.236326"
       x2="46.991879"
       y1="48.29256"
       x1="30.004028"
       id="linearGradient1892"
       xlink:href="#linearGradient1864"
       inkscape:collect="always"
       gradientTransform="scale(1.1881952,0.8416125)"
       gradientUnits="userSpaceOnUse" />
    <linearGradient
       y2="55.364545"
       x2="57.766843"
       y1="64.189009"
       x1="37.100519"
       id="linearGradient1885"
       xlink:href="#linearGradient1880"
       inkscape:collect="always"
       gradientTransform="scale(0.9647977,1.0364867)"
       gradientUnits="userSpaceOnUse" />
    <linearGradient
       y2="28.712817"
       x2="138.16479"
       y1="13.649529"
       x1="159.22134"
       id="linearGradient1879"
       xlink:href="#linearGradient1880"
       inkscape:collect="always"
       gradientTransform="scale(0.7424299,1.3469285)"
       gradientUnits="userSpaceOnUse" />
    <linearGradient
       y2="68.13968"
       x2="139.04483"
       y1="87.531549"
       x1="105.24821"
       id="linearGradient1873"
       xlink:href="#linearGradient1874"
       inkscape:collect="always"
       gradientTransform="scale(0.8192924,1.2205655)"
       gradientUnits="userSpaceOnUse" />
    <linearGradient
       id="linearGradient1864">
      <stop
         id="stop1865"
         offset="0.0000000"
         style="stop-color:#ffffff;stop-opacity:1.0000000;" />
      <stop
         id="stop1866"
         offset="1.0000000"
         style="stop-color:#ffffff;stop-opacity:0.0000000;" />
    </linearGradient>
    <linearGradient
       id="linearGradient1874">
      <stop
         id="stop1875"
         offset="0.0000000"
         style="stop-color:#ffffff;stop-opacity:0.0000000;" />
      <stop
         id="stop1877"
         offset="0.50000000"
         style="stop-color:#ffffff;stop-opacity:0.24719101;" />
      <stop
         id="stop1876"
         offset="1.0000000"
         style="stop-color:#ffffff;stop-opacity:0.0000000;" />
    </linearGradient>
    <linearGradient
       id="linearGradient1880">
      <stop
         id="stop1881"
         offset="0.0000000"
         style="stop-color:#000000;stop-opacity:1.0000000;" />
      <stop
         id="stop1883"
         offset="1.0000000"
         style="stop-color:#000000;stop-opacity:0.0000000;" />
    </linearGradient>
    <linearGradient
       id="linearGradient2303">
      <stop
         style="stop-color:#000000;stop-opacity:1.0000000;"
         offset="0.0000000"
         id="stop2305" />
      <stop
         style="stop-color:#000000;stop-opacity:0.0000000;"
         offset="1.0000000"
         id="stop2307" />
    </linearGradient>
    <linearGradient
       id="linearGradient2295">
      <stop
         style="stop-color:#ffffff;stop-opacity:0.0000000;"
         offset="0.0000000"
         id="stop2297" />
      <stop
         style="stop-color:#ffffff;stop-opacity:0.24719101;"
         offset="0.50000000"
         id="stop2299" />
      <stop
         style="stop-color:#ffffff;stop-opacity:0.0000000;"
         offset="1.0000000"
         id="stop2301" />
    </linearGradient>
    <linearGradient
       id="linearGradient2289">
      <stop
         style="stop-color:#ffffff;stop-opacity:1.0000000;"
         offset="0.0000000"
         id="stop2291" />
      <stop
         style="stop-color:#ffffff;stop-opacity:0.0000000;"
         offset="1.0000000"
         id="stop2293" />
    </linearGradient>
    <linearGradient
       gradientUnits="userSpaceOnUse"
       gradientTransform="scale(0.8192924,1.2205655)"
       inkscape:collect="always"
       xlink:href="#linearGradient1874"
       id="linearGradient2287"
       x1="105.24821"
       y1="87.531549"
       x2="139.04483"
       y2="68.13968" />
    <linearGradient
       gradientUnits="userSpaceOnUse"
       gradientTransform="scale(0.7424299,1.3469285)"
       inkscape:collect="always"
       xlink:href="#linearGradient1880"
       id="linearGradient2285"
       x1="159.22134"
       y1="13.649529"
       x2="138.16479"
       y2="28.712817" />
    <linearGradient
       gradientUnits="userSpaceOnUse"
       gradientTransform="scale(0.9647977,1.0364867)"
       inkscape:collect="always"
       xlink:href="#linearGradient1880"
       id="linearGradient2283"
       x1="37.100519"
       y1="64.189009"
       x2="57.766843"
       y2="55.364545" />
    <linearGradient
       gradientUnits="userSpaceOnUse"
       gradientTransform="scale(1.1881952,0.8416125)"
       inkscape:collect="always"
       xlink:href="#linearGradient1864"
       id="linearGradient2281"
       x1="30.004028"
       y1="48.29256"
       x2="46.991879"
       y2="38.236326" />
    <linearGradient
       gradientUnits="userSpaceOnUse"
       gradientTransform="scale(1.6994649,0.5884205)"
       inkscape:collect="always"
       xlink:href="#linearGradient1864"
       id="linearGradient2279"
       x1="35.220662"
       y1="31.992172"
       x2="38.929003"
       y2="29.25222" />
    <linearGradient
       gradientUnits="userSpaceOnUse"
       gradientTransform="scale(1.5060779,0.6639763)"
       inkscape:collect="always"
       xlink:href="#linearGradient1864"
       id="linearGradient2277"
       x1="40.244443"
       y1="37.148447"
       x2="44.079405"
       y2="33.451355" />
    <linearGradient
       gradientUnits="userSpaceOnUse"
       gradientTransform="scale(1.1062026,0.9039935)"
       inkscape:collect="always"
       xlink:href="#linearGradient1874"
       id="linearGradient2275"
       x1="60.063359"
       y1="23.480421"
       x2="65.888471"
       y2="20.89794" />
    <linearGradient
       gradientUnits="userSpaceOnUse"
       gradientTransform="scale(1.2654625,0.7902249)"
       inkscape:collect="always"
       xlink:href="#linearGradient1864"
       id="linearGradient2273"
       x1="70.862513"
       y1="6.3908208"
       x2="54.972651"
       y2="17.524179" />
    <linearGradient
       gradientUnits="userSpaceOnUse"
       gradientTransform="scale(1.684253,0.593735)"
       inkscape:collect="always"
       xlink:href="#linearGradient1864"
       id="linearGradient2271"
       x1="36.909282"
       y1="19.488885"
       x2="33.89451"
       y2="21.841769" />
    <linearGradient
       gradientUnits="userSpaceOnUse"
       gradientTransform="scale(1.0123027,0.9878468)"
       inkscape:collect="always"
       xlink:href="#linearGradient1864"
       id="linearGradient2269"
       x1="49.75035"
       y1="150.48783"
       x2="71.528184"
       y2="129.34454" />
    <linearGradient
       gradientTransform="matrix(0.942544,0,0,0.921824,2.781224,4.166134)"
       gradientUnits="userSpaceOnUse"
       y2="68.967857"
       x2="55.155025"
       y1="106.66622"
       x1="55.137867"
       id="linearGradient2267"
       xlink:href="#linearGradient2805"
       inkscape:collect="always" />
    <linearGradient
       gradientUnits="userSpaceOnUse"
       y2="49.549633"
       x2="36.764706"
       y1="9.5986519"
       x1="35.784313"
       id="linearGradient2265"
       xlink:href="#linearGradient2776"
       inkscape:collect="always" />
    <linearGradient
       id="linearGradient2259">
      <stop
         id="stop2261"
         offset="0"
         style="stop-color:#ff1f1f;stop-opacity:0.75663716;" />
      <stop
         id="stop2263"
         offset="1"
         style="stop-color:#cb0000;stop-opacity:0.80973452;" />
    </linearGradient>
    <linearGradient
       id="linearGradient2247">
      <stop
         id="stop2249"
         offset="0"
         style="stop-color:black;stop-opacity:1;" />
      <stop
         id="stop2251"
         offset="1"
         style="stop-color:black;stop-opacity:0;" />
    </linearGradient>
  </defs>
  <sodipodi:namedview
     id="base"
     pagecolor="#ffffff"
     bordercolor="#666666"
     borderopacity="1.0"
     inkscape:pageopacity="0.0"
     inkscape:pageshadow="2"
     inkscape:zoom="8.18"
     inkscape:cx="49"
     inkscape:cy="25"
     inkscape:document-units="px"
     inkscape:current-layer="layer1"
     width="98px"
     height="50px"
     inkscape:window-width="989"
     inkscape:window-height="626"
     inkscape:window-x="436"
     inkscape:window-y="111"
     showborder="true" />
  <metadata
     id="metadata7">
    <rdf:RDF>
      <cc:Work
         rdf:about="">
        <dc:format>image/svg+xml</dc:format>
        <dc:type
           rdf:resource="http://purl.org/dc/dcmitype/StillImage" />
      </cc:Work>
    </rdf:RDF>
  </metadata>
  <g
     inkscape:label="Ebene 1"
     inkscape:groupmode="layer"
     id="layer1"
     transform="translate(-0.3969162,-0.1800056)">
    <g
       transform="matrix(0.8768412,0,0,0.8768412,3.0265843,3.5901863)"
       id="g2309"
       inkscape:label="Ebene 1">
      <path
         id="rect2210"
         d="M -1.2448975,5.3770659 C -2.6216869,6.8035881 0.0016748137,11.555007 4.625811,16.017919 L 13.611974,24.690789 L 4.9114935,33.705573 C 0.44857881,38.329703 -2.0045877,43.171189 -0.57806319,44.54798 C 0.84846131,45.924771 5.5998826,43.301407 10.062796,38.677268 L 18.763286,29.662484 L 27.77807,38.362974 C 32.4022,42.825887 37.243686,45.279042 38.620477,43.852524 C 39.997269,42.426004 37.373905,37.674575 32.749765,33.211663 L 23.734981,24.511184 L 32.407852,15.525014 C 36.870763,10.900884 39.323924,6.0593938 37.897402,4.6826074 C 36.470882,3.3058158 31.719453,5.9291795 27.256539,10.553321 L 18.583682,19.539478 L 9.5975106,10.866619 C 4.9733803,6.4037064 0.13189211,3.9505329 -1.2448975,5.3770659 z "
         style="opacity:1;fill:#ff0000;fill-opacity:1;stroke:none;stroke-opacity:1" />
    </g>
  </g>
</svg>
