<?xml version="1.0" encoding="UTF-8" standalone="no"?>
<!-- Created with Inkscape (http://www.inkscape.org/) -->
<svg
   xmlns:dc="http://purl.org/dc/elements/1.1/"
   xmlns:cc="http://creativecommons.org/ns#"
   xmlns:rdf="http://www.w3.org/1999/02/22-rdf-syntax-ns#"
   xmlns:svg="http://www.w3.org/2000/svg"
   xmlns="http://www.w3.org/2000/svg"
   xmlns:xlink="http://www.w3.org/1999/xlink"
   xmlns:sodipodi="http://sodipodi.sourceforge.net/DTD/sodipodi-0.dtd"
   xmlns:inkscape="http://www.inkscape.org/namespaces/inkscape"
   width="272"
   height="32"
   id="svg6485"
   sodipodi:version="0.32"
   inkscape:version="0.46"
   version="1.0"
   sodipodi:docname="background.svg"
   inkscape:output_extension="org.inkscape.output.svg.inkscape">
  <defs
     id="defs6487">
    <linearGradient
       inkscape:collect="always"
       xlink:href="#linearGradient3324"
       id="linearGradient5503"
       gradientUnits="userSpaceOnUse"
       gradientTransform="translate(6.200031,513.96968)"
       x1="325.6098"
       y1="416.52335"
       x2="325.6098"
       y2="421.24097" />
    <linearGradient
       inkscape:collect="always"
       xlink:href="#linearGradient3324"
       id="linearGradient5501"
       gradientUnits="userSpaceOnUse"
       gradientTransform="translate(6.200031,513.96968)"
       x1="325.6098"
       y1="416.52335"
       x2="325.6098"
       y2="421.24097" />
    <linearGradient
       inkscape:collect="always"
       xlink:href="#linearGradient3324"
       id="linearGradient5499"
       gradientUnits="userSpaceOnUse"
       gradientTransform="translate(6.200031,513.96968)"
       x1="325.6098"
       y1="416.52335"
       x2="325.6098"
       y2="421.24097" />
    <linearGradient
       inkscape:collect="always"
       xlink:href="#linearGradient3324"
       id="linearGradient5497"
       gradientUnits="userSpaceOnUse"
       gradientTransform="translate(6.200031,513.96968)"
       x1="325.6098"
       y1="416.52335"
       x2="325.6098"
       y2="421.24097" />
    <linearGradient
       inkscape:collect="always"
       xlink:href="#linearGradient3324"
       id="linearGradient5495"
       gradientUnits="userSpaceOnUse"
       gradientTransform="translate(6.200031,513.96968)"
       x1="325.6098"
       y1="416.52335"
       x2="325.6098"
       y2="421.24097" />
    <linearGradient
       inkscape:collect="always"
       xlink:href="#linearGradient3324"
       id="linearGradient5493"
       gradientUnits="userSpaceOnUse"
       gradientTransform="translate(6.200031,513.96968)"
       x1="325.6098"
       y1="416.52335"
       x2="325.6098"
       y2="421.24097" />
    <linearGradient
       inkscape:collect="always"
       xlink:href="#linearGradient3324"
       id="linearGradient5491"
       gradientUnits="userSpaceOnUse"
       gradientTransform="translate(6.200031,513.96968)"
       x1="325.6098"
       y1="416.52335"
       x2="325.6098"
       y2="421.24097" />
    <linearGradient
       inkscape:collect="always"
       xlink:href="#linearGradient3324"
       id="linearGradient5489"
       gradientUnits="userSpaceOnUse"
       gradientTransform="translate(6.200031,513.96968)"
       x1="325.6098"
       y1="416.52335"
       x2="325.6098"
       y2="421.24097" />
    <linearGradient
       inkscape:collect="always"
       xlink:href="#linearGradient3324"
       id="linearGradient5487"
       gradientUnits="userSpaceOnUse"
       gradientTransform="translate(6.200031,513.96968)"
       x1="325.6098"
       y1="416.52335"
       x2="325.6098"
       y2="421.24097" />
    <linearGradient
       inkscape:collect="always"
       xlink:href="#linearGradient3324"
       id="linearGradient5485"
       gradientUnits="userSpaceOnUse"
       gradientTransform="translate(6.200031,513.96968)"
       x1="325.6098"
       y1="416.52335"
       x2="325.6098"
       y2="421.24097" />
    <linearGradient
       inkscape:collect="always"
       xlink:href="#linearGradient3324"
       id="linearGradient5483"
       gradientUnits="userSpaceOnUse"
       gradientTransform="translate(6.200031,513.96968)"
       x1="325.6098"
       y1="416.52335"
       x2="325.6098"
       y2="421.24097" />
    <linearGradient
       inkscape:collect="always"
       xlink:href="#linearGradient3324"
       id="linearGradient5481"
       gradientUnits="userSpaceOnUse"
       gradientTransform="translate(6.200031,513.96968)"
       x1="325.6098"
       y1="416.52335"
       x2="325.6098"
       y2="421.24097" />
    <linearGradient
       inkscape:collect="always"
       xlink:href="#linearGradient3324"
       id="linearGradient5479"
       gradientUnits="userSpaceOnUse"
       gradientTransform="translate(6.200031,513.96968)"
       x1="325.6098"
       y1="416.52335"
       x2="325.6098"
       y2="421.24097" />
    <linearGradient
       inkscape:collect="always"
       xlink:href="#linearGradient3324"
       id="linearGradient5477"
       gradientUnits="userSpaceOnUse"
       gradientTransform="translate(6.200031,513.96968)"
       x1="325.6098"
       y1="416.52335"
       x2="325.6098"
       y2="421.24097" />
    <linearGradient
       inkscape:collect="always"
       xlink:href="#linearGradient3324"
       id="linearGradient5475"
       gradientUnits="userSpaceOnUse"
       gradientTransform="translate(6.200031,513.96968)"
       x1="325.6098"
       y1="416.52335"
       x2="325.6098"
       y2="421.24097" />
    <linearGradient
       inkscape:collect="always"
       xlink:href="#linearGradient3324"
       id="linearGradient5473"
       gradientUnits="userSpaceOnUse"
       gradientTransform="translate(6.200031,513.96968)"
       x1="325.6098"
       y1="416.52335"
       x2="325.6098"
       y2="421.24097" />
    <linearGradient
       inkscape:collect="always"
       xlink:href="#linearGradient3324"
       id="linearGradient5471"
       gradientUnits="userSpaceOnUse"
       gradientTransform="translate(6.200031,513.96968)"
       x1="325.6098"
       y1="416.52335"
       x2="325.6098"
       y2="421.24097" />
    <linearGradient
       inkscape:collect="always"
       xlink:href="#linearGradient3324"
       id="linearGradient5469"
       gradientUnits="userSpaceOnUse"
       gradientTransform="translate(6.200031,513.96968)"
       x1="325.6098"
       y1="416.52335"
       x2="325.6098"
       y2="421.24097" />
    <linearGradient
       inkscape:collect="always"
       xlink:href="#linearGradient3324"
       id="linearGradient5467"
       gradientUnits="userSpaceOnUse"
       gradientTransform="translate(6.200031,513.96968)"
       x1="325.6098"
       y1="416.52335"
       x2="325.6098"
       y2="421.24097" />
    <linearGradient
       inkscape:collect="always"
       xlink:href="#linearGradient3324"
       id="linearGradient5465"
       gradientUnits="userSpaceOnUse"
       gradientTransform="translate(6.200031,513.96968)"
       x1="325.6098"
       y1="416.52335"
       x2="325.6098"
       y2="421.24097" />
    <linearGradient
       inkscape:collect="always"
       xlink:href="#linearGradient3324"
       id="linearGradient5463"
       gradientUnits="userSpaceOnUse"
       gradientTransform="translate(6.200031,513.96968)"
       x1="325.6098"
       y1="416.52335"
       x2="325.6098"
       y2="421.24097" />
    <marker
       style="overflow:visible"
       id="DotSf"
       refX="0"
       refY="0"
       orient="auto"
       inkscape:stockid="DotSf">
      <path
         transform="matrix(0.2,0,0,0.2,1.48,0.2)"
         style="fill:#eeeeec;fill-rule:evenodd;stroke:#eeeeec;stroke-width:1pt;marker-start:none;marker-end:none"
         d="M -2.5,-1 C -2.5,1.76 -4.74,4 -7.5,4 C -10.26,4 -12.5,1.76 -12.5,-1 C -12.5,-3.76 -10.26,-6 -7.5,-6 C -4.74,-6 -2.5,-3.76 -2.5,-1 z"
         id="path4787" />
    </marker>
    <linearGradient
       inkscape:collect="always"
       xlink:href="#linearGradient3324"
       id="linearGradient5461"
       gradientUnits="userSpaceOnUse"
       gradientTransform="translate(6.200031,513.96968)"
       x1="325.6098"
       y1="416.52335"
       x2="325.6098"
       y2="421.24097" />
    <linearGradient
       inkscape:collect="always"
       xlink:href="#linearGradient3324"
       id="linearGradient5459"
       gradientUnits="userSpaceOnUse"
       gradientTransform="translate(6.200031,513.96968)"
       x1="325.6098"
       y1="416.52335"
       x2="325.6098"
       y2="421.24097" />
    <linearGradient
       inkscape:collect="always"
       xlink:href="#linearGradient3324"
       id="linearGradient5457"
       gradientUnits="userSpaceOnUse"
       gradientTransform="translate(6.200031,513.96968)"
       x1="325.6098"
       y1="416.52335"
       x2="325.6098"
       y2="421.24097" />
    <linearGradient
       inkscape:collect="always"
       xlink:href="#linearGradient3324"
       id="linearGradient5455"
       gradientUnits="userSpaceOnUse"
       gradientTransform="translate(6.200031,513.96968)"
       x1="325.6098"
       y1="416.52335"
       x2="325.6098"
       y2="421.24097" />
    <linearGradient
       inkscape:collect="always"
       xlink:href="#linearGradient3324"
       id="linearGradient5453"
       gradientUnits="userSpaceOnUse"
       gradientTransform="translate(6.200031,513.96968)"
       x1="325.6098"
       y1="416.52335"
       x2="325.6098"
       y2="421.24097" />
    <linearGradient
       inkscape:collect="always"
       xlink:href="#linearGradient3324"
       id="linearGradient5451"
       gradientUnits="userSpaceOnUse"
       gradientTransform="translate(6.200031,513.96968)"
       x1="325.6098"
       y1="416.52335"
       x2="325.6098"
       y2="421.24097" />
    <linearGradient
       id="linearGradient3324"
       inkscape:collect="always">
      <stop
         id="stop3326"
         offset="0"
         style="stop-color:#eeeeec;stop-opacity:1" />
      <stop
         style="stop-color:#bbbeb7;stop-opacity:1;"
         offset="0.22391395"
         id="stop3328" />
      <stop
         id="stop3330"
         offset="1"
         style="stop-color:#d3d7cf;stop-opacity:1" />
    </linearGradient>
    <linearGradient
       inkscape:collect="always"
       xlink:href="#linearGradient3324"
       id="linearGradient5449"
       gradientUnits="userSpaceOnUse"
       gradientTransform="translate(6.200031,513.96968)"
       x1="325.6098"
       y1="416.52335"
       x2="325.6098"
       y2="421.24097" />
    <linearGradient
       inkscape:collect="always"
       xlink:href="#linearGradient3179"
       id="linearGradient5447"
       gradientUnits="userSpaceOnUse"
       gradientTransform="translate(6.200031,593.96968)"
       x1="178.74265"
       y1="425.36218"
       x2="178.74265"
       y2="433.43857" />
    <linearGradient
       inkscape:collect="always"
       id="linearGradient3179">
      <stop
         style="stop-color:#eeeeec;stop-opacity:1"
         offset="0"
         id="stop3181" />
      <stop
         id="stop3185"
         offset="0.05499936"
         style="stop-color:#bbbeb7;stop-opacity:1;" />
      <stop
         style="stop-color:#d3d7cf;stop-opacity:1"
         offset="1"
         id="stop3183" />
    </linearGradient>
    <linearGradient
       inkscape:collect="always"
       xlink:href="#linearGradient3179"
       id="linearGradient5445"
       gradientUnits="userSpaceOnUse"
       x1="178.74265"
       y1="425.36218"
       x2="178.74265"
       y2="433.43857" />
    <linearGradient
       id="linearGradient5074">
      <stop
         style="stop-color:#979b91;stop-opacity:1;"
         offset="0"
         id="stop5076" />
      <stop
         style="stop-color:#d3d7cf;stop-opacity:1"
         offset="1"
         id="stop5078" />
    </linearGradient>
    <linearGradient
       inkscape:collect="always"
       xlink:href="#linearGradient5074"
       id="linearGradient5443"
       gradientUnits="userSpaceOnUse"
       x1="190"
       y1="432.36218"
       x2="190"
       y2="417.36218" />
    <linearGradient
       id="linearGradient3157"
       inkscape:collect="always">
      <stop
         id="stop3159"
         offset="0"
         style="stop-color:#babdb6;stop-opacity:1;" />
      <stop
         id="stop3161"
         offset="1"
         style="stop-color:#d3d7cf;stop-opacity:1" />
    </linearGradient>
    <linearGradient
       inkscape:collect="always"
       xlink:href="#linearGradient3157"
       id="linearGradient5441"
       gradientUnits="userSpaceOnUse"
       gradientTransform="matrix(1.0424264,0,0,1.0424264,-8.1034437,-18.046589)"
       x1="190"
       y1="432.36218"
       x2="190"
       y2="417.36218" />
    <filter
       inkscape:collect="always"
       id="filter4947"
       x="-0.013457442"
       width="1.026915"
       y="-0.11080328"
       height="1.2216066">
      <feGaussianBlur
         inkscape:collect="always"
         stdDeviation="1.198302"
         id="feGaussianBlur4949" />
    </filter>
    <linearGradient
       id="linearGradient4954">
      <stop
         style="stop-color:#000000;stop-opacity:1;"
         offset="0"
         id="stop4956" />
      <stop
         style="stop-color:#000000;stop-opacity:0;"
         offset="1"
         id="stop4958" />
    </linearGradient>
    <linearGradient
       inkscape:collect="always"
       xlink:href="#linearGradient4954"
       id="linearGradient5439"
       gradientUnits="userSpaceOnUse"
       x1="321.3822"
       y1="438.42505"
       x2="321.3822"
       y2="427.17575" />
    <inkscape:perspective
       sodipodi:type="inkscape:persp3d"
       inkscape:vp_x="0 : 526.18109 : 1"
       inkscape:vp_y="0 : 1000 : 0"
       inkscape:vp_z="744.09448 : 526.18109 : 1"
       inkscape:persp3d-origin="372.04724 : 350.78739 : 1"
       id="perspective6493" />
  </defs>
  <sodipodi:namedview
     id="base"
     pagecolor="#ffffff"
     bordercolor="#666666"
     borderopacity="1.0"
     gridtolerance="10000"
     guidetolerance="10"
     objecttolerance="10"
     inkscape:pageopacity="0.0"
     inkscape:pageshadow="2"
     inkscape:zoom="4"
     inkscape:cx="123.57584"
     inkscape:cy="55.921633"
     inkscape:document-units="px"
     inkscape:current-layer="layer1"
     showgrid="false"
     inkscape:showpageshadow="false"
     inkscape:window-width="1600"
     inkscape:window-height="1152"
     inkscape:window-x="0"
     inkscape:window-y="47" />
  <metadata
     id="metadata6490">
    <rdf:RDF>
      <cc:Work
         rdf:about="">
        <dc:format>image/svg+xml</dc:format>
        <dc:type
           rdf:resource="http://purl.org/dc/dcmitype/StillImage" />
      </cc:Work>
    </rdf:RDF>
  </metadata>
  <g
     inkscape:label="Layer 1"
     inkscape:groupmode="layer"
     id="layer1">
    <g
       id="g5559"
       inkscape:export-filename="/home/odd/Desktop/radio.png"
       inkscape:export-xdpi="96"
       inkscape:export-ydpi="96"
       transform="translate(-76.937778,-1004.5998)">
      <g
         style="opacity:1"
         id="g5319"
         transform="matrix(1.1124981,0,0,1.1124981,-95.287105,546.11725)">
        <path
           sodipodi:nodetypes="ccccccccc"
           id="path5321"
           d="M 162.31109,418.24634 L 391.90841,418.24634 C 394.21843,418.24634 396.07812,420.10603 396.07812,422.41604 L 398.77475,435.44648 C 398.77475,437.81506 396.86792,439.72189 394.49935,439.72189 L 159.72015,439.72189 C 157.35158,439.72189 155.44475,437.81506 155.44475,435.44648 L 158.14138,422.41604 C 158.14138,420.10603 160.00107,418.24634 162.31109,418.24634 z"
           style="opacity:0.25;fill:url(#linearGradient5439);fill-opacity:1;stroke:none;stroke-width:0.93701404;stroke-opacity:1;filter:url(#filter4947)" />
        <path
           style="fill:url(#linearGradient5441);fill-opacity:1;stroke:#888a85;stroke-width:0.93701404;stroke-opacity:1"
           d="M 162.31109,412.85306 L 391.90841,412.85306 C 394.21843,412.85306 396.07812,414.71275 396.07812,417.02276 L 396.07812,433.70157 C 396.07812,436.01159 394.21843,437.87128 391.90841,437.87128 L 162.31109,437.87128 C 160.00107,437.87128 158.14138,436.01159 158.14138,433.70157 L 158.14138,417.02276 C 158.14138,414.71275 160.00107,412.85306 162.31109,412.85306 z"
           id="path5323"
           sodipodi:nodetypes="ccccccccc" />
        <path
           style="fill:url(#linearGradient5443);fill-opacity:1;stroke:url(#linearGradient5445);stroke-width:0.89887792;stroke-miterlimit:4;stroke-opacity:1"
           d="M 162.8202,413.36218 L 391.53964,413.36218 C 393.75564,413.36218 395.53964,415.14618 395.53964,417.36218 L 395.53964,433.36218 C 395.53964,435.57818 393.75564,437.36218 391.53964,437.36218 L 162.8202,437.36218 C 160.6042,437.36218 158.8202,435.57818 158.8202,433.36218 L 158.8202,417.36218 C 158.8202,415.14618 160.6042,413.36218 162.8202,413.36218 z"
           id="path5325"
           sodipodi:nodetypes="ccccccccc" />
      </g>
      <path
         style="fill:#555753;fill-opacity:1;stroke:url(#linearGradient5447);stroke-opacity:1"
         d="M 157.20003,1007.3318 L 321.70003,1007.3318 C 323.91603,1007.3318 325.70003,1009.1159 325.70003,1011.3318 L 325.70003,1027.3318 C 325.70003,1029.5478 323.91603,1031.3318 321.70003,1031.3318 L 157.20003,1031.3318 C 154.98403,1031.3318 153.20003,1029.5478 153.20003,1027.3318 L 153.20003,1011.3318 C 153.20003,1009.1159 154.98403,1007.3318 157.20003,1007.3318 z"
         id="path5327"
         sodipodi:nodetypes="ccccccccc" />
      <path
         transform="matrix(0.2378983,0,0,0.2378983,112.89717,910.32849)"
         d="M 200.63186,424.86218 L 192.93921,429.30353 L 185.24657,433.74488 L 185.24657,424.86218 L 185.24657,415.97948 L 192.93921,420.42083 L 200.63186,424.86218 z"
         inkscape:randomized="0"
         inkscape:rounded="0"
         inkscape:flatsided="false"
         sodipodi:arg2="1.0471976"
         sodipodi:arg1="0"
         sodipodi:r2="5.1284289"
         sodipodi:r1="10.256857"
         sodipodi:cy="424.86218"
         sodipodi:cx="190.375"
         sodipodi:sides="3"
         id="path5329"
         style="font-size:8.82012177px;font-style:normal;font-variant:normal;font-weight:bold;font-stretch:normal;text-indent:0;text-align:start;text-decoration:none;line-height:normal;letter-spacing:normal;word-spacing:normal;text-transform:none;direction:ltr;block-progression:tb;writing-mode:lr-tb;text-anchor:start;opacity:0.5;fill:#eeeeec;fill-opacity:1;fill-rule:nonzero;stroke:none;stroke-width:1.47002029px;stroke-linecap:butt;stroke-linejoin:miter;marker:none;marker-start:none;marker-mid:none;marker-end:none;stroke-miterlimit:4;stroke-dasharray:none;stroke-dashoffset:0;stroke-opacity:1;visibility:visible;display:inline;overflow:visible;enable-background:accumulate;font-family:Bitstream Vera Sans Mono;-inkscape-font-specification:Bitstream Vera Sans Mono Bold"
         sodipodi:type="star" />
      <g
         id="g5331"
         transform="translate(4,80)">
        <path
           transform="matrix(-0.4811846,0,0,0.4811846,488.40309,482.24927)"
           d="M 334.81505,932.68439 A 3.0052037,3.0052037 0 1 1 328.80464,932.68439 A 3.0052037,3.0052037 0 1 1 334.81505,932.68439 z"
           sodipodi:ry="3.0052037"
           sodipodi:rx="3.0052037"
           sodipodi:cy="932.68439"
           sodipodi:cx="331.80984"
           id="path5333"
           style="opacity:1;fill:#555753;fill-opacity:1;fill-rule:nonzero;stroke:url(#linearGradient5449);stroke-width:1;stroke-linecap:butt;stroke-linejoin:miter;marker:none;marker-start:none;marker-mid:none;marker-end:none;stroke-miterlimit:4;stroke-dasharray:none;stroke-dashoffset:0;stroke-opacity:1;visibility:visible;display:inline;overflow:visible;enable-background:accumulate"
           sodipodi:type="arc" />
        <path
           sodipodi:type="arc"
           style="opacity:1;fill:#555753;fill-opacity:1;fill-rule:nonzero;stroke:url(#linearGradient5451);stroke-width:1;stroke-linecap:butt;stroke-linejoin:miter;marker:none;marker-start:none;marker-mid:none;marker-end:none;stroke-miterlimit:4;stroke-dasharray:none;stroke-dashoffset:0;stroke-opacity:1;visibility:visible;display:inline;overflow:visible;enable-background:accumulate"
           id="path5335"
           sodipodi:cx="331.80984"
           sodipodi:cy="932.68439"
           sodipodi:rx="3.0052037"
           sodipodi:ry="3.0052037"
           d="M 334.81505,932.68439 A 3.0052037,3.0052037 0 1 1 328.80464,932.68439 A 3.0052037,3.0052037 0 1 1 334.81505,932.68439 z"
           transform="matrix(-0.4811846,0,0,0.4811846,491.2902,485.13637)" />
        <path
           transform="matrix(-0.4811846,0,0,0.4811846,488.40309,488.02348)"
           d="M 334.81505,932.68439 A 3.0052037,3.0052037 0 1 1 328.80464,932.68439 A 3.0052037,3.0052037 0 1 1 334.81505,932.68439 z"
           sodipodi:ry="3.0052037"
           sodipodi:rx="3.0052037"
           sodipodi:cy="932.68439"
           sodipodi:cx="331.80984"
           id="path5337"
           style="opacity:1;fill:#555753;fill-opacity:1;fill-rule:nonzero;stroke:url(#linearGradient5453);stroke-width:1;stroke-linecap:butt;stroke-linejoin:miter;marker:none;marker-start:none;marker-mid:none;marker-end:none;stroke-miterlimit:4;stroke-dasharray:none;stroke-dashoffset:0;stroke-opacity:1;visibility:visible;display:inline;overflow:visible;enable-background:accumulate"
           sodipodi:type="arc" />
        <path
           sodipodi:type="arc"
           style="opacity:1;fill:#555753;fill-opacity:1;fill-rule:nonzero;stroke:url(#linearGradient5455);stroke-width:1;stroke-linecap:butt;stroke-linejoin:miter;marker:none;marker-start:none;marker-mid:none;marker-end:none;stroke-miterlimit:4;stroke-dasharray:none;stroke-dashoffset:0;stroke-opacity:1;visibility:visible;display:inline;overflow:visible;enable-background:accumulate"
           id="path5339"
           sodipodi:cx="331.80984"
           sodipodi:cy="932.68439"
           sodipodi:rx="3.0052037"
           sodipodi:ry="3.0052037"
           d="M 334.81505,932.68439 A 3.0052037,3.0052037 0 1 1 328.80464,932.68439 A 3.0052037,3.0052037 0 1 1 334.81505,932.68439 z"
           transform="matrix(-0.4811846,0,0,0.4811846,491.2902,490.91059)" />
        <path
           transform="matrix(-0.4811846,0,0,0.4811846,488.40309,493.7977)"
           d="M 334.81505,932.68439 A 3.0052037,3.0052037 0 1 1 328.80464,932.68439 A 3.0052037,3.0052037 0 1 1 334.81505,932.68439 z"
           sodipodi:ry="3.0052037"
           sodipodi:rx="3.0052037"
           sodipodi:cy="932.68439"
           sodipodi:cx="331.80984"
           id="path5341"
           style="opacity:1;fill:#555753;fill-opacity:1;fill-rule:nonzero;stroke:url(#linearGradient5457);stroke-width:1;stroke-linecap:butt;stroke-linejoin:miter;marker:none;marker-start:none;marker-mid:none;marker-end:none;stroke-miterlimit:4;stroke-dasharray:none;stroke-dashoffset:0;stroke-opacity:1;visibility:visible;display:inline;overflow:visible;enable-background:accumulate"
           sodipodi:type="arc" />
        <path
           sodipodi:type="arc"
           style="opacity:1;fill:#555753;fill-opacity:1;fill-rule:nonzero;stroke:url(#linearGradient5459);stroke-width:1;stroke-linecap:butt;stroke-linejoin:miter;marker:none;marker-start:none;marker-mid:none;marker-end:none;stroke-miterlimit:4;stroke-dasharray:none;stroke-dashoffset:0;stroke-opacity:1;visibility:visible;display:inline;overflow:visible;enable-background:accumulate"
           id="path5343"
           sodipodi:cx="331.80984"
           sodipodi:cy="932.68439"
           sodipodi:rx="3.0052037"
           sodipodi:ry="3.0052037"
           d="M 334.81505,932.68439 A 3.0052037,3.0052037 0 1 1 328.80464,932.68439 A 3.0052037,3.0052037 0 1 1 334.81505,932.68439 z"
           transform="matrix(-0.4811846,0,0,0.4811846,491.2902,496.6848)" />
        <path
           transform="matrix(-0.4811846,0,0,0.4811846,488.40309,499.57191)"
           d="M 334.81505,932.68439 A 3.0052037,3.0052037 0 1 1 328.80464,932.68439 A 3.0052037,3.0052037 0 1 1 334.81505,932.68439 z"
           sodipodi:ry="3.0052037"
           sodipodi:rx="3.0052037"
           sodipodi:cy="932.68439"
           sodipodi:cx="331.80984"
           id="path5345"
           style="opacity:1;fill:#555753;fill-opacity:1;fill-rule:nonzero;stroke:url(#linearGradient5461);stroke-width:1;stroke-linecap:butt;stroke-linejoin:miter;marker:none;marker-start:none;marker-mid:none;marker-end:none;stroke-miterlimit:4;stroke-dasharray:none;stroke-dashoffset:0;stroke-opacity:1;visibility:visible;display:inline;overflow:visible;enable-background:accumulate"
           sodipodi:type="arc" />
      </g>
      <text
         xml:space="preserve"
         style="font-size:40px;font-style:normal;font-weight:normal;opacity:0.5;fill:#eeeeec;fill-opacity:1;stroke:none;stroke-width:1px;stroke-linecap:butt;stroke-linejoin:miter;stroke-opacity:1;font-family:Bitstream Vera Sans"
         x="161.25"
         y="1013.6122"
         id="text5347"><tspan
           sodipodi:role="line"
           id="tspan5349"
           x="161.25"
           y="1013.6122"
           style="font-size:6px;font-style:normal;font-variant:normal;font-weight:bold;font-stretch:normal;fill:#eeeeec;font-family:Bitstream Vera Sans Mono;-inkscape-font-specification:Bitstream Vera Sans Mono Bold">FM RADIO</tspan></text>
      <g
         transform="translate(124.26962,81.1875)"
         id="g5351">
        <path
           sodipodi:open="true"
           sodipodi:end="5.7595865"
           sodipodi:start="1.5707963"
           d="M 190,947.36218 A 5,5 0 1 1 194.33013,939.86218"
           sodipodi:ry="5"
           sodipodi:rx="5"
           sodipodi:cy="942.36218"
           sodipodi:cx="190"
           id="path5353"
           style="opacity:0.25;fill:none;fill-opacity:1;fill-rule:nonzero;stroke:#eeeeec;stroke-width:1.15839684px;stroke-linecap:butt;stroke-linejoin:miter;marker:none;marker-start:none;marker-mid:none;marker-end:none;stroke-miterlimit:4;stroke-dasharray:none;stroke-dashoffset:0;stroke-opacity:1;visibility:visible;display:inline;overflow:visible;enable-background:accumulate"
           sodipodi:type="arc"
           transform="matrix(0.6106315,0.6106315,-0.6102054,0.6102054,651.61788,250.19103)" />
        <path
           sodipodi:open="true"
           sodipodi:end="5.7595865"
           sodipodi:start="1.5707963"
           transform="matrix(0.3419537,0.3419536,-0.341715,0.341715,449.65149,554.25502)"
           sodipodi:type="arc"
           style="opacity:0.5;fill:none;fill-opacity:1;fill-rule:nonzero;stroke:#eeeeec;stroke-width:2.06856585px;stroke-linecap:butt;stroke-linejoin:miter;marker:none;marker-start:none;marker-mid:none;marker-end:none;stroke-miterlimit:4;stroke-dasharray:none;stroke-dashoffset:0;stroke-opacity:1;visibility:visible;display:inline;overflow:visible;enable-background:accumulate"
           id="path5355"
           sodipodi:cx="190"
           sodipodi:cy="942.36218"
           sodipodi:rx="5"
           sodipodi:ry="5"
           d="M 190,947.36218 A 5,5 0 1 1 194.33013,939.86218" />
        <path
           sodipodi:open="true"
           sodipodi:end="5.7595865"
           sodipodi:start="1.5707963"
           transform="matrix(0.8793094,0.8793095,-0.8786958,0.8786958,853.58425,-53.872936)"
           sodipodi:type="arc"
           style="opacity:0.12999998;fill:none;fill-opacity:1;fill-rule:nonzero;stroke:#eeeeec;stroke-width:0.80444223px;stroke-linecap:butt;stroke-linejoin:miter;marker:none;marker-start:none;marker-mid:none;marker-end:none;stroke-miterlimit:4;stroke-dasharray:none;stroke-dashoffset:0;stroke-opacity:1;visibility:visible;display:inline;overflow:visible;enable-background:accumulate"
           id="path5357"
           sodipodi:cx="190"
           sodipodi:cy="942.36218"
           sodipodi:rx="5"
           sodipodi:ry="5"
           d="M 190,947.36218 A 5,5 0 1 1 194.33013,939.86218" />
      </g>
      <g
         transform="translate(122.70712,80)"
         id="g5359">
        <path
           sodipodi:nodetypes="ccccccc"
           style="opacity:0.5;fill:none;fill-opacity:1;fill-rule:nonzero;stroke:#eeeeec;stroke-width:1px;stroke-linecap:butt;stroke-linejoin:miter;marker:none;marker-start:url(#DotSf);marker-mid:none;marker-end:none;stroke-miterlimit:4;stroke-dasharray:none;stroke-dashoffset:0;stroke-opacity:1;visibility:visible;display:inline;overflow:visible;enable-background:accumulate"
           d="M 194.15047,942.48932 L 194.14797,945.0782 L 193.36838,945.0782 L 193.36838,948.79972 L 199.0625,948.79972 L 199.0625,945.0782 L 195.27297,945.0782"
           id="path5361" />
        <path
           transform="matrix(0.1867456,0,0,0.1866153,161.52988,771.10672)"
           sodipodi:type="arc"
           style="opacity:0.5;fill:#eeeeec;fill-opacity:1;fill-rule:nonzero;stroke:none;stroke-width:4.90797567px;stroke-linecap:butt;stroke-linejoin:miter;marker:none;marker-start:none;marker-mid:none;marker-end:none;stroke-miterlimit:4;stroke-dasharray:none;stroke-dashoffset:0;stroke-opacity:1;visibility:visible;display:inline;overflow:visible;enable-background:accumulate"
           id="path5363"
           sodipodi:cx="190"
           sodipodi:cy="942.36218"
           sodipodi:rx="5"
           sodipodi:ry="5"
           d="M 195,942.36218 A 5,5 0 1 1 185,942.36218 A 5,5 0 1 1 195,942.36218 z" />
      </g>
      <g
         transform="translate(10,80)"
         id="g5365">
        <path
           sodipodi:type="arc"
           style="opacity:1;fill:#555753;fill-opacity:1;fill-rule:nonzero;stroke:url(#linearGradient5463);stroke-width:1;stroke-linecap:butt;stroke-linejoin:miter;marker:none;marker-start:none;marker-mid:none;marker-end:none;stroke-miterlimit:4;stroke-dasharray:none;stroke-dashoffset:0;stroke-opacity:1;visibility:visible;display:inline;overflow:visible;enable-background:accumulate"
           id="path5367"
           sodipodi:cx="331.80984"
           sodipodi:cy="932.68439"
           sodipodi:rx="3.0052037"
           sodipodi:ry="3.0052037"
           d="M 334.81505,932.68439 A 3.0052037,3.0052037 0 1 1 328.80464,932.68439 A 3.0052037,3.0052037 0 1 1 334.81505,932.68439 z"
           transform="matrix(-0.4811846,0,0,0.4811846,488.40309,482.24927)" />
        <path
           transform="matrix(-0.4811846,0,0,0.4811846,491.2902,485.13637)"
           d="M 334.81505,932.68439 A 3.0052037,3.0052037 0 1 1 328.80464,932.68439 A 3.0052037,3.0052037 0 1 1 334.81505,932.68439 z"
           sodipodi:ry="3.0052037"
           sodipodi:rx="3.0052037"
           sodipodi:cy="932.68439"
           sodipodi:cx="331.80984"
           id="path5369"
           style="opacity:1;fill:#555753;fill-opacity:1;fill-rule:nonzero;stroke:url(#linearGradient5465);stroke-width:1;stroke-linecap:butt;stroke-linejoin:miter;marker:none;marker-start:none;marker-mid:none;marker-end:none;stroke-miterlimit:4;stroke-dasharray:none;stroke-dashoffset:0;stroke-opacity:1;visibility:visible;display:inline;overflow:visible;enable-background:accumulate"
           sodipodi:type="arc" />
        <path
           sodipodi:type="arc"
           style="opacity:1;fill:#555753;fill-opacity:1;fill-rule:nonzero;stroke:url(#linearGradient5467);stroke-width:1;stroke-linecap:butt;stroke-linejoin:miter;marker:none;marker-start:none;marker-mid:none;marker-end:none;stroke-miterlimit:4;stroke-dasharray:none;stroke-dashoffset:0;stroke-opacity:1;visibility:visible;display:inline;overflow:visible;enable-background:accumulate"
           id="path5371"
           sodipodi:cx="331.80984"
           sodipodi:cy="932.68439"
           sodipodi:rx="3.0052037"
           sodipodi:ry="3.0052037"
           d="M 334.81505,932.68439 A 3.0052037,3.0052037 0 1 1 328.80464,932.68439 A 3.0052037,3.0052037 0 1 1 334.81505,932.68439 z"
           transform="matrix(-0.4811846,0,0,0.4811846,488.40309,488.02348)" />
        <path
           transform="matrix(-0.4811846,0,0,0.4811846,491.2902,490.91059)"
           d="M 334.81505,932.68439 A 3.0052037,3.0052037 0 1 1 328.80464,932.68439 A 3.0052037,3.0052037 0 1 1 334.81505,932.68439 z"
           sodipodi:ry="3.0052037"
           sodipodi:rx="3.0052037"
           sodipodi:cy="932.68439"
           sodipodi:cx="331.80984"
           id="path5373"
           style="opacity:1;fill:#555753;fill-opacity:1;fill-rule:nonzero;stroke:url(#linearGradient5469);stroke-width:1;stroke-linecap:butt;stroke-linejoin:miter;marker:none;marker-start:none;marker-mid:none;marker-end:none;stroke-miterlimit:4;stroke-dasharray:none;stroke-dashoffset:0;stroke-opacity:1;visibility:visible;display:inline;overflow:visible;enable-background:accumulate"
           sodipodi:type="arc" />
        <path
           sodipodi:type="arc"
           style="opacity:1;fill:#555753;fill-opacity:1;fill-rule:nonzero;stroke:url(#linearGradient5471);stroke-width:1;stroke-linecap:butt;stroke-linejoin:miter;marker:none;marker-start:none;marker-mid:none;marker-end:none;stroke-miterlimit:4;stroke-dasharray:none;stroke-dashoffset:0;stroke-opacity:1;visibility:visible;display:inline;overflow:visible;enable-background:accumulate"
           id="path5375"
           sodipodi:cx="331.80984"
           sodipodi:cy="932.68439"
           sodipodi:rx="3.0052037"
           sodipodi:ry="3.0052037"
           d="M 334.81505,932.68439 A 3.0052037,3.0052037 0 1 1 328.80464,932.68439 A 3.0052037,3.0052037 0 1 1 334.81505,932.68439 z"
           transform="matrix(-0.4811846,0,0,0.4811846,488.40309,493.7977)" />
        <path
           transform="matrix(-0.4811846,0,0,0.4811846,491.2902,496.6848)"
           d="M 334.81505,932.68439 A 3.0052037,3.0052037 0 1 1 328.80464,932.68439 A 3.0052037,3.0052037 0 1 1 334.81505,932.68439 z"
           sodipodi:ry="3.0052037"
           sodipodi:rx="3.0052037"
           sodipodi:cy="932.68439"
           sodipodi:cx="331.80984"
           id="path5377"
           style="opacity:1;fill:#555753;fill-opacity:1;fill-rule:nonzero;stroke:url(#linearGradient5473);stroke-width:1;stroke-linecap:butt;stroke-linejoin:miter;marker:none;marker-start:none;marker-mid:none;marker-end:none;stroke-miterlimit:4;stroke-dasharray:none;stroke-dashoffset:0;stroke-opacity:1;visibility:visible;display:inline;overflow:visible;enable-background:accumulate"
           sodipodi:type="arc" />
        <path
           sodipodi:type="arc"
           style="opacity:1;fill:#555753;fill-opacity:1;fill-rule:nonzero;stroke:url(#linearGradient5475);stroke-width:1;stroke-linecap:butt;stroke-linejoin:miter;marker:none;marker-start:none;marker-mid:none;marker-end:none;stroke-miterlimit:4;stroke-dasharray:none;stroke-dashoffset:0;stroke-opacity:1;visibility:visible;display:inline;overflow:visible;enable-background:accumulate"
           id="path5379"
           sodipodi:cx="331.80984"
           sodipodi:cy="932.68439"
           sodipodi:rx="3.0052037"
           sodipodi:ry="3.0052037"
           d="M 334.81505,932.68439 A 3.0052037,3.0052037 0 1 1 328.80464,932.68439 A 3.0052037,3.0052037 0 1 1 334.81505,932.68439 z"
           transform="matrix(-0.4811846,0,0,0.4811846,488.40309,499.57191)" />
      </g>
      <g
         transform="matrix(-1,0,0,1,422.36971,80)"
         id="g5381">
        <path
           sodipodi:type="arc"
           style="opacity:1;fill:#555753;fill-opacity:1;fill-rule:nonzero;stroke:url(#linearGradient5477);stroke-width:1;stroke-linecap:butt;stroke-linejoin:miter;marker:none;marker-start:none;marker-mid:none;marker-end:none;stroke-miterlimit:4;stroke-dasharray:none;stroke-dashoffset:0;stroke-opacity:1;visibility:visible;display:inline;overflow:visible;enable-background:accumulate"
           id="path5383"
           sodipodi:cx="331.80984"
           sodipodi:cy="932.68439"
           sodipodi:rx="3.0052037"
           sodipodi:ry="3.0052037"
           d="M 334.81505,932.68439 A 3.0052037,3.0052037 0 1 1 328.80464,932.68439 A 3.0052037,3.0052037 0 1 1 334.81505,932.68439 z"
           transform="matrix(-0.4811846,0,0,0.4811846,488.40309,482.24927)" />
        <path
           transform="matrix(-0.4811846,0,0,0.4811846,491.2902,485.13637)"
           d="M 334.81505,932.68439 A 3.0052037,3.0052037 0 1 1 328.80464,932.68439 A 3.0052037,3.0052037 0 1 1 334.81505,932.68439 z"
           sodipodi:ry="3.0052037"
           sodipodi:rx="3.0052037"
           sodipodi:cy="932.68439"
           sodipodi:cx="331.80984"
           id="path5385"
           style="opacity:1;fill:#555753;fill-opacity:1;fill-rule:nonzero;stroke:url(#linearGradient5479);stroke-width:1;stroke-linecap:butt;stroke-linejoin:miter;marker:none;marker-start:none;marker-mid:none;marker-end:none;stroke-miterlimit:4;stroke-dasharray:none;stroke-dashoffset:0;stroke-opacity:1;visibility:visible;display:inline;overflow:visible;enable-background:accumulate"
           sodipodi:type="arc" />
        <path
           sodipodi:type="arc"
           style="opacity:1;fill:#555753;fill-opacity:1;fill-rule:nonzero;stroke:url(#linearGradient5481);stroke-width:1;stroke-linecap:butt;stroke-linejoin:miter;marker:none;marker-start:none;marker-mid:none;marker-end:none;stroke-miterlimit:4;stroke-dasharray:none;stroke-dashoffset:0;stroke-opacity:1;visibility:visible;display:inline;overflow:visible;enable-background:accumulate"
           id="path5387"
           sodipodi:cx="331.80984"
           sodipodi:cy="932.68439"
           sodipodi:rx="3.0052037"
           sodipodi:ry="3.0052037"
           d="M 334.81505,932.68439 A 3.0052037,3.0052037 0 1 1 328.80464,932.68439 A 3.0052037,3.0052037 0 1 1 334.81505,932.68439 z"
           transform="matrix(-0.4811846,0,0,0.4811846,488.40309,488.02348)" />
        <path
           transform="matrix(-0.4811846,0,0,0.4811846,491.2902,490.91059)"
           d="M 334.81505,932.68439 A 3.0052037,3.0052037 0 1 1 328.80464,932.68439 A 3.0052037,3.0052037 0 1 1 334.81505,932.68439 z"
           sodipodi:ry="3.0052037"
           sodipodi:rx="3.0052037"
           sodipodi:cy="932.68439"
           sodipodi:cx="331.80984"
           id="path5389"
           style="opacity:1;fill:#555753;fill-opacity:1;fill-rule:nonzero;stroke:url(#linearGradient5483);stroke-width:1;stroke-linecap:butt;stroke-linejoin:miter;marker:none;marker-start:none;marker-mid:none;marker-end:none;stroke-miterlimit:4;stroke-dasharray:none;stroke-dashoffset:0;stroke-opacity:1;visibility:visible;display:inline;overflow:visible;enable-background:accumulate"
           sodipodi:type="arc" />
        <path
           sodipodi:type="arc"
           style="opacity:1;fill:#555753;fill-opacity:1;fill-rule:nonzero;stroke:url(#linearGradient5485);stroke-width:1;stroke-linecap:butt;stroke-linejoin:miter;marker:none;marker-start:none;marker-mid:none;marker-end:none;stroke-miterlimit:4;stroke-dasharray:none;stroke-dashoffset:0;stroke-opacity:1;visibility:visible;display:inline;overflow:visible;enable-background:accumulate"
           id="path5391"
           sodipodi:cx="331.80984"
           sodipodi:cy="932.68439"
           sodipodi:rx="3.0052037"
           sodipodi:ry="3.0052037"
           d="M 334.81505,932.68439 A 3.0052037,3.0052037 0 1 1 328.80464,932.68439 A 3.0052037,3.0052037 0 1 1 334.81505,932.68439 z"
           transform="matrix(-0.4811846,0,0,0.4811846,488.40309,493.7977)" />
        <path
           transform="matrix(-0.4811846,0,0,0.4811846,491.2902,496.6848)"
           d="M 334.81505,932.68439 A 3.0052037,3.0052037 0 1 1 328.80464,932.68439 A 3.0052037,3.0052037 0 1 1 334.81505,932.68439 z"
           sodipodi:ry="3.0052037"
           sodipodi:rx="3.0052037"
           sodipodi:cy="932.68439"
           sodipodi:cx="331.80984"
           id="path5393"
           style="opacity:1;fill:#555753;fill-opacity:1;fill-rule:nonzero;stroke:url(#linearGradient5487);stroke-width:1;stroke-linecap:butt;stroke-linejoin:miter;marker:none;marker-start:none;marker-mid:none;marker-end:none;stroke-miterlimit:4;stroke-dasharray:none;stroke-dashoffset:0;stroke-opacity:1;visibility:visible;display:inline;overflow:visible;enable-background:accumulate"
           sodipodi:type="arc" />
        <path
           sodipodi:type="arc"
           style="opacity:1;fill:#555753;fill-opacity:1;fill-rule:nonzero;stroke:url(#linearGradient5489);stroke-width:1;stroke-linecap:butt;stroke-linejoin:miter;marker:none;marker-start:none;marker-mid:none;marker-end:none;stroke-miterlimit:4;stroke-dasharray:none;stroke-dashoffset:0;stroke-opacity:1;visibility:visible;display:inline;overflow:visible;enable-background:accumulate"
           id="path5395"
           sodipodi:cx="331.80984"
           sodipodi:cy="932.68439"
           sodipodi:rx="3.0052037"
           sodipodi:ry="3.0052037"
           d="M 334.81505,932.68439 A 3.0052037,3.0052037 0 1 1 328.80464,932.68439 A 3.0052037,3.0052037 0 1 1 334.81505,932.68439 z"
           transform="matrix(-0.4811846,0,0,0.4811846,488.40309,499.57191)" />
      </g>
      <g
         id="g5397"
         transform="matrix(-1,0,0,1,416.36971,80)">
        <path
           transform="matrix(-0.4811846,0,0,0.4811846,488.40309,482.24927)"
           d="M 334.81505,932.68439 A 3.0052037,3.0052037 0 1 1 328.80464,932.68439 A 3.0052037,3.0052037 0 1 1 334.81505,932.68439 z"
           sodipodi:ry="3.0052037"
           sodipodi:rx="3.0052037"
           sodipodi:cy="932.68439"
           sodipodi:cx="331.80984"
           id="path5399"
           style="opacity:1;fill:#555753;fill-opacity:1;fill-rule:nonzero;stroke:url(#linearGradient5491);stroke-width:1;stroke-linecap:butt;stroke-linejoin:miter;marker:none;marker-start:none;marker-mid:none;marker-end:none;stroke-miterlimit:4;stroke-dasharray:none;stroke-dashoffset:0;stroke-opacity:1;visibility:visible;display:inline;overflow:visible;enable-background:accumulate"
           sodipodi:type="arc" />
        <path
           sodipodi:type="arc"
           style="opacity:1;fill:#555753;fill-opacity:1;fill-rule:nonzero;stroke:url(#linearGradient5493);stroke-width:1;stroke-linecap:butt;stroke-linejoin:miter;marker:none;marker-start:none;marker-mid:none;marker-end:none;stroke-miterlimit:4;stroke-dasharray:none;stroke-dashoffset:0;stroke-opacity:1;visibility:visible;display:inline;overflow:visible;enable-background:accumulate"
           id="path5401"
           sodipodi:cx="331.80984"
           sodipodi:cy="932.68439"
           sodipodi:rx="3.0052037"
           sodipodi:ry="3.0052037"
           d="M 334.81505,932.68439 A 3.0052037,3.0052037 0 1 1 328.80464,932.68439 A 3.0052037,3.0052037 0 1 1 334.81505,932.68439 z"
           transform="matrix(-0.4811846,0,0,0.4811846,491.2902,485.13637)" />
        <path
           transform="matrix(-0.4811846,0,0,0.4811846,488.40309,488.02348)"
           d="M 334.81505,932.68439 A 3.0052037,3.0052037 0 1 1 328.80464,932.68439 A 3.0052037,3.0052037 0 1 1 334.81505,932.68439 z"
           sodipodi:ry="3.0052037"
           sodipodi:rx="3.0052037"
           sodipodi:cy="932.68439"
           sodipodi:cx="331.80984"
           id="path5403"
           style="opacity:1;fill:#555753;fill-opacity:1;fill-rule:nonzero;stroke:url(#linearGradient5495);stroke-width:1;stroke-linecap:butt;stroke-linejoin:miter;marker:none;marker-start:none;marker-mid:none;marker-end:none;stroke-miterlimit:4;stroke-dasharray:none;stroke-dashoffset:0;stroke-opacity:1;visibility:visible;display:inline;overflow:visible;enable-background:accumulate"
           sodipodi:type="arc" />
        <path
           sodipodi:type="arc"
           style="opacity:1;fill:#555753;fill-opacity:1;fill-rule:nonzero;stroke:url(#linearGradient5497);stroke-width:1;stroke-linecap:butt;stroke-linejoin:miter;marker:none;marker-start:none;marker-mid:none;marker-end:none;stroke-miterlimit:4;stroke-dasharray:none;stroke-dashoffset:0;stroke-opacity:1;visibility:visible;display:inline;overflow:visible;enable-background:accumulate"
           id="path5405"
           sodipodi:cx="331.80984"
           sodipodi:cy="932.68439"
           sodipodi:rx="3.0052037"
           sodipodi:ry="3.0052037"
           d="M 334.81505,932.68439 A 3.0052037,3.0052037 0 1 1 328.80464,932.68439 A 3.0052037,3.0052037 0 1 1 334.81505,932.68439 z"
           transform="matrix(-0.4811846,0,0,0.4811846,491.2902,490.91059)" />
        <path
           transform="matrix(-0.4811846,0,0,0.4811846,488.40309,493.7977)"
           d="M 334.81505,932.68439 A 3.0052037,3.0052037 0 1 1 328.80464,932.68439 A 3.0052037,3.0052037 0 1 1 334.81505,932.68439 z"
           sodipodi:ry="3.0052037"
           sodipodi:rx="3.0052037"
           sodipodi:cy="932.68439"
           sodipodi:cx="331.80984"
           id="path5407"
           style="opacity:1;fill:#555753;fill-opacity:1;fill-rule:nonzero;stroke:url(#linearGradient5499);stroke-width:1;stroke-linecap:butt;stroke-linejoin:miter;marker:none;marker-start:none;marker-mid:none;marker-end:none;stroke-miterlimit:4;stroke-dasharray:none;stroke-dashoffset:0;stroke-opacity:1;visibility:visible;display:inline;overflow:visible;enable-background:accumulate"
           sodipodi:type="arc" />
        <path
           sodipodi:type="arc"
           style="opacity:1;fill:#555753;fill-opacity:1;fill-rule:nonzero;stroke:url(#linearGradient5501);stroke-width:1;stroke-linecap:butt;stroke-linejoin:miter;marker:none;marker-start:none;marker-mid:none;marker-end:none;stroke-miterlimit:4;stroke-dasharray:none;stroke-dashoffset:0;stroke-opacity:1;visibility:visible;display:inline;overflow:visible;enable-background:accumulate"
           id="path5409"
           sodipodi:cx="331.80984"
           sodipodi:cy="932.68439"
           sodipodi:rx="3.0052037"
           sodipodi:ry="3.0052037"
           d="M 334.81505,932.68439 A 3.0052037,3.0052037 0 1 1 328.80464,932.68439 A 3.0052037,3.0052037 0 1 1 334.81505,932.68439 z"
           transform="matrix(-0.4811846,0,0,0.4811846,491.2902,496.6848)" />
        <path
           transform="matrix(-0.4811846,0,0,0.4811846,488.40309,499.57191)"
           d="M 334.81505,932.68439 A 3.0052037,3.0052037 0 1 1 328.80464,932.68439 A 3.0052037,3.0052037 0 1 1 334.81505,932.68439 z"
           sodipodi:ry="3.0052037"
           sodipodi:rx="3.0052037"
           sodipodi:cy="932.68439"
           sodipodi:cx="331.80984"
           id="path5411"
           style="opacity:1;fill:#555753;fill-opacity:1;fill-rule:nonzero;stroke:url(#linearGradient5503);stroke-width:1;stroke-linecap:butt;stroke-linejoin:miter;marker:none;marker-start:none;marker-mid:none;marker-end:none;stroke-miterlimit:4;stroke-dasharray:none;stroke-dashoffset:0;stroke-opacity:1;visibility:visible;display:inline;overflow:visible;enable-background:accumulate"
           sodipodi:type="arc" />
      </g>
    </g>
  </g>
</svg>
