<?xml version="1.0" encoding="UTF-8" standalone="no"?>
<!-- Created with Inkscape (http://www.inkscape.org/) -->
<svg
   xmlns:dc="http://purl.org/dc/elements/1.1/"
   xmlns:cc="http://web.resource.org/cc/"
   xmlns:rdf="http://www.w3.org/1999/02/22-rdf-syntax-ns#"
   xmlns:svg="http://www.w3.org/2000/svg"
   xmlns="http://www.w3.org/2000/svg"
   xmlns:xlink="http://www.w3.org/1999/xlink"
   xmlns:sodipodi="http://sodipodi.sourceforge.net/DTD/sodipodi-0.dtd"
   xmlns:inkscape="http://www.inkscape.org/namespaces/inkscape"
   width="100"
   height="100"
   id="svg2"
   sodipodi:version="0.32"
   inkscape:version="0.45.1"
   sodipodi:docbase="/home/deathcarrot/.screenlets/VolumeControl/themes/cone"
   sodipodi:docname="vol_bar.svg"
   inkscape:output_extension="org.inkscape.output.svg.inkscape"
   version="1.0">
  <defs
     id="defs4">
    <linearGradient
       inkscape:collect="always"
       id="linearGradient8163">
      <stop
         style="stop-color:#000000;stop-opacity:1;"
         offset="0"
         id="stop8165" />
      <stop
         style="stop-color:#000000;stop-opacity:0;"
         offset="1"
         id="stop8167" />
    </linearGradient>
    <linearGradient
       id="linearGradient7143">
      <stop
         id="stop7145"
         offset="0"
         style="stop-color:#dee4e4;stop-opacity:0;" />
      <stop
         id="stop7147"
         offset="1"
         style="stop-color:#7c8e92;stop-opacity:1;" />
    </linearGradient>
    <linearGradient
       id="linearGradient6164">
      <stop
         id="stop6166"
         offset="0"
         style="stop-color:#315683;stop-opacity:1;" />
      <stop
         id="stop6168"
         offset="1"
         style="stop-color:#52acd1;stop-opacity:1;" />
    </linearGradient>
    <linearGradient
       inkscape:collect="always"
       id="linearGradient28424">
      <stop
         style="stop-color:#000000;stop-opacity:1;"
         offset="0"
         id="stop28426" />
      <stop
         style="stop-color:#000000;stop-opacity:0;"
         offset="1"
         id="stop28428" />
    </linearGradient>
    <linearGradient
       id="linearGradient28416">
      <stop
         id="stop28418"
         offset="0"
         style="stop-color:#dee4e4;stop-opacity:0;" />
      <stop
         id="stop28420"
         offset="1"
         style="stop-color:#7c8e92;stop-opacity:1;" />
    </linearGradient>
    <linearGradient
       inkscape:collect="always"
       id="linearGradient27423">
      <stop
         style="stop-color:#000000;stop-opacity:1;"
         offset="0"
         id="stop27425" />
      <stop
         style="stop-color:#000000;stop-opacity:0;"
         offset="1"
         id="stop27427" />
    </linearGradient>
    <linearGradient
       id="linearGradient16196">
      <stop
         id="stop16198"
         offset="0"
         style="stop-color:#002fff;stop-opacity:1;" />
      <stop
         id="stop16202"
         offset="1"
         style="stop-color:#345163;stop-opacity:1;" />
    </linearGradient>
    <linearGradient
       id="linearGradient12250">
      <stop
         id="stop12252"
         offset="0"
         style="stop-color:#c1d0d9;stop-opacity:1;" />
      <stop
         id="stop12254"
         offset="1"
         style="stop-color:#7c8e92;stop-opacity:1;" />
    </linearGradient>
    <linearGradient
       id="linearGradient9161">
      <stop
         id="stop9163"
         offset="0"
         style="stop-color:#dee4e4;stop-opacity:0.63917524;" />
      <stop
         id="stop9165"
         offset="1"
         style="stop-color:#7c8e92;stop-opacity:0.59793812;" />
    </linearGradient>
    <linearGradient
       id="linearGradient4147">
      <stop
         style="stop-color:#ffffff;stop-opacity:1;"
         offset="0"
         id="stop4149" />
      <stop
         id="stop5132"
         offset="0.5"
         style="stop-color:#c4c4c4;stop-opacity:1;" />
      <stop
         style="stop-color:#484848;stop-opacity:1;"
         offset="1"
         id="stop4151" />
    </linearGradient>
    <linearGradient
       id="linearGradient2197">
      <stop
         style="stop-color:#dee4e4;stop-opacity:1;"
         offset="0"
         id="stop2199" />
      <stop
         style="stop-color:#7c8e92;stop-opacity:1;"
         offset="1"
         id="stop2201" />
    </linearGradient>
    <radialGradient
       inkscape:collect="always"
       xlink:href="#linearGradient2197"
       id="radialGradient3176"
       cx="301.73849"
       cy="559.36578"
       fx="301.73849"
       fy="559.36578"
       r="59.5"
       gradientTransform="matrix(0.4381715,-1.8386547,2.5217999,0.6009727,-1224.4885,767.65817)"
       gradientUnits="userSpaceOnUse" />
    <radialGradient
       inkscape:collect="always"
       xlink:href="#linearGradient4147"
       id="radialGradient6103"
       cx="350.2962"
       cy="544.34894"
       fx="350.2962"
       fy="544.34894"
       r="58.375"
       gradientTransform="matrix(-4.1940674e-2,0.6518532,-1.1122513,-7.1562927e-2,879.23451,270.9872)"
       gradientUnits="userSpaceOnUse" />
    <radialGradient
       inkscape:collect="always"
       xlink:href="#linearGradient9161"
       id="radialGradient6107"
       gradientUnits="userSpaceOnUse"
       gradientTransform="matrix(-1.0000016,1.4403928,-1.822609,-1.2653576,1473.0456,699.64261)"
       cx="304.09964"
       cy="514.25842"
       fx="304.09964"
       fy="514.25842"
       r="59.5" />
    <radialGradient
       inkscape:collect="always"
       xlink:href="#linearGradient12250"
       id="radialGradient12258"
       gradientUnits="userSpaceOnUse"
       gradientTransform="matrix(2.6727072e-2,3.0044381,-1.5061735,1.3398693e-2,1012.9562,-406.57328)"
       cx="300.37317"
       cy="501.78699"
       fx="300.37317"
       fy="501.78699"
       r="59.5" />
    <linearGradient
       inkscape:collect="always"
       xlink:href="#linearGradient27423"
       id="linearGradient27429"
       x1="317.35281"
       y1="563.76001"
       x2="398.73697"
       y2="740.06525"
       gradientUnits="userSpaceOnUse"
       gradientTransform="matrix(0.3397687,-3.5255188e-2,3.5255188e-2,0.3397687,138.66902,287.81803)" />
    <radialGradient
       inkscape:collect="always"
       xlink:href="#linearGradient4147"
       id="radialGradient27439"
       gradientUnits="userSpaceOnUse"
       gradientTransform="matrix(-0.1227797,1.908275,-3.2560726,-0.2094977,2107.8163,228.4665)"
       cx="350.2962"
       cy="544.34894"
       fx="350.2962"
       fy="544.34894"
       r="58.375" />
    <radialGradient
       inkscape:collect="always"
       xlink:href="#linearGradient9161"
       id="radialGradient27443"
       gradientUnits="userSpaceOnUse"
       gradientTransform="matrix(-1.0000016,1.4403928,-1.822609,-1.2653576,1473.0456,699.64261)"
       cx="304.09964"
       cy="514.25842"
       fx="304.09964"
       fy="514.25842"
       r="59.5" />
    <radialGradient
       inkscape:collect="always"
       xlink:href="#linearGradient12250"
       id="radialGradient27445"
       gradientUnits="userSpaceOnUse"
       gradientTransform="matrix(2.6727072e-2,3.0044381,-1.5061735,1.3398693e-2,1012.9562,-406.57328)"
       cx="300.37317"
       cy="501.78699"
       fx="300.37317"
       fy="501.78699"
       r="59.5" />
    <linearGradient
       inkscape:collect="always"
       xlink:href="#linearGradient28416"
       id="linearGradient28422"
       x1="287.93643"
       y1="443.03543"
       x2="287.93643"
       y2="418.86212"
       gradientUnits="userSpaceOnUse" />
    <linearGradient
       inkscape:collect="always"
       xlink:href="#linearGradient28424"
       id="linearGradient28430"
       x1="287.93643"
       y1="418.86212"
       x2="287.93643"
       y2="443.03543"
       gradientUnits="userSpaceOnUse" />
    <linearGradient
       inkscape:collect="always"
       xlink:href="#linearGradient6164"
       id="linearGradient5193"
       gradientUnits="userSpaceOnUse"
       x1="380.14316"
       y1="418.96582"
       x2="436.17319"
       y2="664.63873"
       gradientTransform="matrix(0.2454278,0,0,0.3207401,200.29897,288.07995)" />
    <linearGradient
       inkscape:collect="always"
       xlink:href="#linearGradient7143"
       id="linearGradient8161"
       x1="380.14343"
       y1="624.91931"
       x2="380.14343"
       y2="664.63898"
       gradientUnits="userSpaceOnUse" />
    <linearGradient
       inkscape:collect="always"
       xlink:href="#linearGradient8163"
       id="linearGradient8169"
       x1="380.14343"
       y1="664.63898"
       x2="380.14343"
       y2="624.91931"
       gradientUnits="userSpaceOnUse" />
    <linearGradient
       inkscape:collect="always"
       xlink:href="#linearGradient2197"
       id="linearGradient8176"
       gradientUnits="userSpaceOnUse"
       x1="380.14316"
       y1="418.96582"
       x2="436.17319"
       y2="664.63873"
       gradientTransform="matrix(0.3415929,0,0,0.3415929,159.92123,276.78182)" />
    <linearGradient
       inkscape:collect="always"
       xlink:href="#linearGradient2197"
       id="linearGradient8179"
       gradientUnits="userSpaceOnUse"
       gradientTransform="matrix(0.3332503,0,0,0.3332503,167.37142,281.30187)"
       x1="282.76492"
       y1="375.9144"
       x2="442.32339"
       y2="590.8363" />
    <linearGradient
       inkscape:collect="always"
       xlink:href="#linearGradient7143"
       id="linearGradient8190"
       gradientUnits="userSpaceOnUse"
       x1="380.14343"
       y1="624.91931"
       x2="380.14343"
       y2="664.63898"
       gradientTransform="matrix(0.3415929,0,0,-0.341112,159.92123,730.53398)" />
    <linearGradient
       inkscape:collect="always"
       xlink:href="#linearGradient8163"
       id="linearGradient8192"
       gradientUnits="userSpaceOnUse"
       x1="380.14343"
       y1="664.63898"
       x2="380.14343"
       y2="624.91931"
       gradientTransform="matrix(0.3415929,0,0,-0.341112,159.92123,730.53398)" />
    <linearGradient
       inkscape:collect="always"
       xlink:href="#linearGradient7143"
       id="linearGradient8195"
       gradientUnits="userSpaceOnUse"
       x1="380.14343"
       y1="624.91931"
       x2="380.14343"
       y2="664.63898"
       gradientTransform="matrix(0.3415929,0,0,-0.341112,159.92123,730.53398)" />
    <linearGradient
       inkscape:collect="always"
       xlink:href="#linearGradient8163"
       id="linearGradient8197"
       gradientUnits="userSpaceOnUse"
       x1="380.14343"
       y1="664.63898"
       x2="380.14343"
       y2="624.91931"
       gradientTransform="matrix(0.3415929,0,0,-0.341112,159.92123,730.53398)" />
    <linearGradient
       inkscape:collect="always"
       xlink:href="#linearGradient28424"
       id="linearGradient8201"
       gradientUnits="userSpaceOnUse"
       x1="321.6398"
       y1="664.51624"
       x2="472.8804"
       y2="635.63873"
       gradientTransform="matrix(0.3415929,0,0,0.3415929,159.92123,276.78182)" />
  </defs>
  <sodipodi:namedview
     id="base"
     pagecolor="#ffffff"
     bordercolor="#666666"
     borderopacity="1.0"
     gridtolerance="10000"
     guidetolerance="10"
     objecttolerance="10"
     inkscape:pageopacity="0.0"
     inkscape:pageshadow="2"
     inkscape:zoom="2.8284271"
     inkscape:cx="59.934254"
     inkscape:cy="51.494282"
     inkscape:document-units="px"
     inkscape:current-layer="g7182"
     inkscape:window-width="922"
     inkscape:window-height="649"
     inkscape:window-x="18"
     inkscape:window-y="79"
     height="100px"
     width="100px" />
  <metadata
     id="metadata7">
    <rdf:RDF>
      <cc:Work
         rdf:about="">
        <dc:format>image/svg+xml</dc:format>
        <dc:type
           rdf:resource="http://purl.org/dc/dcmitype/StillImage" />
      </cc:Work>
    </rdf:RDF>
  </metadata>
  <g
     inkscape:label="Layer 1"
     inkscape:groupmode="layer"
     id="layer1"
     transform="translate(-231.5,-418.86218)">
    <g
       id="g7182">
      <path
         id="path5191"
         style="fill:url(#linearGradient5193);fill-opacity:1;fill-rule:evenodd;stroke:#000000;stroke-width:0.20901346px;stroke-linecap:butt;stroke-linejoin:miter;stroke-opacity:1"
         d="M 292.93926,501.13676 L 301.04368,501.13676 L 300.81488,426.68904 L 292.66336,426.68904 L 292.93926,501.13676 z "
         sodipodi:nodetypes="ccccc" />
    </g>
  </g>
</svg>
