<?xml version='1.0' encoding='UTF-8'?>
<!-- This file was generated by dvisvgm 2.2 -->
<svg height='11.9552pt' version='1.1' viewBox='56.4133 56.787 63.6661 11.9552' width='63.6661pt' xmlns='http://www.w3.org/2000/svg' xmlns:xlink='http://www.w3.org/1999/xlink'>
<defs>
<path d='M0.382565 -5.44359V-5.18057H0.557908C1.17161 -5.18057 1.18755 -5.0929 1.18755 -4.79801V-0.645579C1.18755 -0.350685 1.17161 -0.263014 0.557908 -0.263014H0.382565V0H3.63437C4.73425 0 5.51532 -0.70137 5.51532 -1.45853C5.51532 -2.10411 4.90162 -2.73375 3.90535 -2.84533C4.7741 -3.02864 5.27621 -3.55467 5.27621 -4.09664C5.27621 -4.80598 4.4792 -5.44359 3.41121 -5.44359H0.382565ZM1.86501 -2.94097V-4.8538C1.86501 -5.12478 1.88095 -5.18057 2.24757 -5.18057H3.35542C4.14446 -5.18057 4.50311 -4.56687 4.50311 -4.09664C4.50311 -3.55467 4.02491 -2.94097 3.11631 -2.94097H1.86501ZM2.24757 -0.263014C1.88095 -0.263014 1.86501 -0.318804 1.86501 -0.589788V-2.71781H3.48294C4.25604 -2.71781 4.71034 -2.09614 4.71034 -1.4665C4.71034 -0.820922 4.17634 -0.263014 3.36339 -0.263014H2.24757Z' id='g2-66'/>
<path d='M2.02441 -5.26027C1.96065 -5.41968 1.95268 -5.44359 1.72951 -5.44359H0.390535V-5.18057H0.565878C1.17958 -5.18057 1.19552 -5.0929 1.19552 -4.79801V-0.852802C1.19552 -0.645579 1.19552 -0.263014 0.390535 -0.263014V0C0.749191 -0.0239103 1.12379 -0.0239103 1.33101 -0.0239103S1.91283 -0.0239103 2.27148 0V-0.263014C1.4665 -0.263014 1.4665 -0.645579 1.4665 -0.852802V-5.08493L1.47447 -5.0929L3.48294 -0.191283C3.53076 -0.0876712 3.56264 0 3.67422 0C3.77783 0 3.81768 -0.0956413 3.85753 -0.191283L5.88991 -5.15666L5.89788 -5.14869V-0.645579C5.89788 -0.350685 5.88194 -0.263014 5.26824 -0.263014H5.0929V0C5.72254 -0.0239103 5.73848 -0.0239103 6.22466 -0.0239103S6.72677 -0.0239103 7.35641 0V-0.263014H7.18107C6.56737 -0.263014 6.55143 -0.350685 6.55143 -0.645579V-4.79801C6.55143 -5.0929 6.56737 -5.18057 7.18107 -5.18057H7.35641V-5.44359H6.00946C5.79427 -5.44359 5.77833 -5.41968 5.72254 -5.27621L3.87347 -0.757161L2.02441 -5.26027Z' id='g2-77'/>
<path d='M5.28418 -4.64658C5.49938 -5.1726 6.00149 -5.18057 6.1609 -5.18057V-5.44359C5.92976 -5.41968 5.52329 -5.41968 5.37186 -5.41968S4.8538 -5.41968 4.49514 -5.44359V-5.18057C4.84583 -5.18057 5.03711 -5.00523 5.03711 -4.79004C5.03711 -4.72628 5.02914 -4.70237 4.98929 -4.61469L3.41121 -0.757161L1.74545 -4.80598C1.71357 -4.88568 1.69763 -4.91756 1.69763 -4.94944C1.69763 -5.18057 2.12005 -5.18057 2.3193 -5.18057V-5.44359C1.64184 -5.41968 1.6259 -5.41968 1.20349 -5.41968C0.820922 -5.41968 0.581818 -5.41968 0.175342 -5.44359V-5.18057C0.653549 -5.18057 0.828892 -5.18057 0.956413 -4.87771L2.94894 -0.00797011C3.0127 0.143462 3.07646 0.167372 3.16413 0.167372C3.3076 0.167372 3.33151 0.103611 3.37933 -0.00797011L5.28418 -4.64658Z' id='g2-86'/>
<path d='M3.88543 2.90511C3.88543 2.86924 3.88543 2.84533 3.68219 2.64209C2.48667 1.43462 1.81719 -0.537983 1.81719 -2.97684C1.81719 -5.29614 2.37908 -7.29265 3.76588 -8.70336C3.88543 -8.81096 3.88543 -8.83487 3.88543 -8.87073C3.88543 -8.94247 3.82565 -8.96638 3.77783 -8.96638C3.62242 -8.96638 2.64209 -8.1056 2.05629 -6.934C1.44658 -5.72653 1.17161 -4.44732 1.17161 -2.97684C1.17161 -1.91283 1.33898 -0.490162 1.96065 0.789041C2.666 2.22366 3.64633 3.00075 3.77783 3.00075C3.82565 3.00075 3.88543 2.97684 3.88543 2.90511Z' id='g3-40'/>
<path d='M3.37136 -2.97684C3.37136 -3.88543 3.25181 -5.36787 2.58232 -6.75467C1.87696 -8.18929 0.896638 -8.96638 0.765131 -8.96638C0.71731 -8.96638 0.657534 -8.94247 0.657534 -8.87073C0.657534 -8.83487 0.657534 -8.81096 0.860772 -8.60772C2.05629 -7.40025 2.72578 -5.42765 2.72578 -2.98879C2.72578 -0.669489 2.16389 1.32702 0.777086 2.73773C0.657534 2.84533 0.657534 2.86924 0.657534 2.90511C0.657534 2.97684 0.71731 3.00075 0.765131 3.00075C0.920548 3.00075 1.90087 2.13998 2.48667 0.968369C3.09639 -0.251059 3.37136 -1.54222 3.37136 -2.97684Z' id='g3-41'/>
<path d='M8.30884 -2.7736C8.3208 -2.80946 8.35666 -2.89315 8.35666 -2.94097C8.35666 -3.00075 8.30884 -3.06052 8.23711 -3.06052C8.18929 -3.06052 8.16538 -3.04857 8.12951 -3.0127C8.1056 -3.00075 8.1056 -2.97684 7.99801 -2.73773C7.29265 -1.06401 6.77858 -0.3467 4.86575 -0.3467H3.1203C2.95293 -0.3467 2.92902 -0.3467 2.85729 -0.358655C2.72578 -0.37061 2.71382 -0.394521 2.71382 -0.490162C2.71382 -0.573848 2.73773 -0.645579 2.76164 -0.753176L3.58655 -4.0528H4.77011C5.70262 -4.0528 5.77435 -3.84956 5.77435 -3.49091C5.77435 -3.37136 5.77435 -3.26376 5.69066 -2.90511C5.66675 -2.85729 5.65479 -2.80946 5.65479 -2.7736C5.65479 -2.68991 5.71457 -2.65405 5.7863 -2.65405C5.8939 -2.65405 5.90585 -2.73773 5.95367 -2.90511L6.63512 -5.6787C6.63512 -5.73848 6.5873 -5.79826 6.51557 -5.79826C6.40797 -5.79826 6.39601 -5.75044 6.34819 -5.58306C6.10909 -4.66252 5.86999 -4.3995 4.80598 -4.3995H3.67024L4.41146 -7.34047C4.51905 -7.7589 4.54296 -7.79477 5.03313 -7.79477H6.74271C8.2132 -7.79477 8.51208 -7.40025 8.51208 -6.49166C8.51208 -6.4797 8.51208 -6.14496 8.46426 -5.75044C8.4523 -5.70262 8.44035 -5.63088 8.44035 -5.60697C8.44035 -5.51133 8.50012 -5.47547 8.57186 -5.47547C8.65554 -5.47547 8.70336 -5.52329 8.72727 -5.73848L8.97833 -7.83064C8.97833 -7.8665 9.00224 -7.98605 9.00224 -8.00996C9.00224 -8.14147 8.89465 -8.14147 8.67945 -8.14147H2.84533C2.61818 -8.14147 2.49863 -8.14147 2.49863 -7.92628C2.49863 -7.79477 2.58232 -7.79477 2.78555 -7.79477C3.52677 -7.79477 3.52677 -7.71108 3.52677 -7.57958C3.52677 -7.5198 3.51482 -7.47198 3.47895 -7.34047L1.86501 -0.884682C1.75741 -0.466252 1.7335 -0.3467 0.896638 -0.3467C0.669489 -0.3467 0.549938 -0.3467 0.549938 -0.131507C0.549938 0 0.621669 0 0.860772 0H6.86227C7.12528 0 7.13724 -0.0119552 7.22092 -0.203238L8.30884 -2.7736Z' id='g1-69'/>
<path d='M8.63163 -3.99303C8.63163 -4.25604 8.5599 -4.37559 8.46426 -4.37559C8.40448 -4.37559 8.30884 -4.29191 8.29689 -4.06476C8.24907 -2.91706 7.46002 -2.25953 6.62316 -2.25953C5.86999 -2.25953 5.29614 -2.7736 4.71034 -3.28767C4.10062 -3.83761 3.47895 -4.38755 2.666 -4.38755C1.36289 -4.38755 0.657534 -3.07248 0.657534 -1.98456C0.657534 -1.60199 0.812951 -1.60199 0.824907 -1.60199C0.956413 -1.60199 0.992279 -1.8411 0.992279 -1.87696C1.0401 -3.19203 1.93674 -3.71806 2.666 -3.71806C3.41918 -3.71806 3.99303 -3.20399 4.57883 -2.68991C5.18854 -2.13998 5.81021 -1.59004 6.62316 -1.59004C7.92628 -1.59004 8.63163 -2.90511 8.63163 -3.99303Z' id='g0-24'/>
</defs>
<g id='page1'>
<use x='56.4133' xlink:href='#g3-40' y='65.7534'/>
<use x='60.9656' xlink:href='#g1-69' y='65.7534'/>
<use x='73.6526' xlink:href='#g0-24' y='65.7534'/>
<use x='86.2719' xlink:href='#g1-69' y='65.7534'/>
<use x='94.9373' xlink:href='#g2-86' y='67.5467'/>
<use x='101.28' xlink:href='#g2-66' y='67.5467'/>
<use x='107.275' xlink:href='#g2-77' y='67.5467'/>
<use x='115.527' xlink:href='#g3-41' y='65.7534'/>
</g>
</svg>