{
  "area": [
    {
      "height": 15,
      "ypos": 688,
      "xpos": 943,
      "type": "match",
      "width": 58
    }
  ],
  "properties": [],
  "tags": [
    "kgpg_tips_close"
  ]
}