{
  "$schema": "http://json-schema.org/draft-07/schema#",
  "$id": "fif-product.json",
  "title": "FIF single product schema",
  "type": "object",
  "required": [
    "arch",
    "distri",
    "flavor",
    "version"
  ],
  "properties": {
    "arch": { "$ref": "fif-arch.json" },
    "distri": { "$ref": "fif-distri.json" },
    "flavor": { "type": "string" },
    "version": { "$ref": "fif-version.json" },
    "settings": { "$ref": "fif-settingshash.json" },
    "name": { "type": "string" },
    "description": { "type": "string" }
  },
  "additionalProperties": false
}
