update changelog, upload 2.6.1-1 to unstable

4 jobs for debian/libcacard-2.6.1-1 in 6 minutes and 53 seconds (queued for 2 seconds)
latest
Status Job ID Name Coverage
  Build
passed #91478
Build

00:03:15

 
  Test
failed #91479
Check

00:03:24

failed #91480
allowed to fail
Memcheck

00:03:38

failed #91481
allowed to fail
asan

00:03:33

 
Name Stage Failure
failed
Memcheck Test
	URL: pkcs11:model=SoftHSM%20v2;manufacturer=SoftHSM%20project;serial=65c052dedc467a7a;token=SC%20test;id=%02;object=RSA_sign;type=private
Type: Private key (RSA-1024)
Label: RSA_sign
Flags: CKA_WRAP/UNWRAP; CKA_PRIVATE; CKA_NEVER_EXTRACTABLE; CKA_SENSITIVE;
ID: 02

ERROR: Failed to add module "SoftHSM PKCS#11". Probable cause : "Unknown PKCS #11 error.".
make: *** [Makefile:2045: tests/softhsm2.conf] Error 22
ERROR: Job failed: exit code 1
failed
asan Test
ERROR: Failed to add module "SoftHSM PKCS#11". Probable cause : "Unknown PKCS #11 error.".
make[3]: *** [Makefile:2045: tests/softhsm2.conf] Error 22
make[3]: Leaving directory '/builds/qemu-team/libcacard'
make[2]: *** [Makefile:1820: check-am] Error 2
make[2]: Leaving directory '/builds/qemu-team/libcacard'
make[1]: *** [Makefile:1350: check-recursive] Error 1
make[1]: Leaving directory '/builds/qemu-team/libcacard'
make: *** [Makefile:1824: check] Error 2
ERROR: Job failed: exit code 1
failed
Check Test
ERROR: Failed to add module "SoftHSM PKCS#11". Probable cause : "Unknown PKCS #11 error.".
make[3]: *** [Makefile:2045: tests/softhsm2.conf] Error 22
make[3]: Leaving directory '/builds/qemu-team/libcacard'
make[2]: *** [Makefile:1820: check-am] Error 2
make[2]: Leaving directory '/builds/qemu-team/libcacard'
make[1]: *** [Makefile:1350: check-recursive] Error 1
make[1]: Leaving directory '/builds/qemu-team/libcacard'
make: *** [Makefile:1824: check] Error 2
ERROR: Job failed: exit code 1