Bump Standards-Version to 4.4.1.

1 job for master in 2 minutes and 10 seconds (queued for 3 seconds)
Status Job ID Name Coverage
  Deploy
failed #347156
pages

00:02:10

 
Name Stage Failure
failed
pages Deploy
done.
make[1]: *** [debian/rules:14: override_dh_auto_test] Error 2
make[1]: Leaving directory '/builds/reproducible-builds/strip-nondeterminism'
make: *** [debian/rules:4: binary] Error 2
dpkg-buildpackage: error: debian/rules binary subprocess returned exit status 2
debuild: fatal error at line 1182:
dpkg-buildpackage -us -uc -ui -i -I failed
gbp:error: 'debuild -i -I -uc -us' failed: it exited with 29
ERROR: Job failed: exit code 1