sbuild (Debian sbuild) 0.81.2 (31 January 2021) on ip-172-31-21-37.us-east-2.compute.internal

+===============================================================================+
| ruby-shadow 2.5.0-1+rebuild1633395333 (amd64) Tue, 05 Oct 2021 00:55:35 +0000 |
+===============================================================================+

Package: ruby-shadow
Version: 2.5.0-1+rebuild1633395333
Source Version: 2.5.0-1+rebuild1633395333
Distribution: experimental
Machine Architecture: amd64
Host Architecture: amd64
Build Architecture: amd64
Build Type: binary

I: NOTICE: Log filtering will replace 'var/run/schroot/mount/experimental-amd64-mass-rebuild-a29d31a7-6724-4e8e-8a50-a473a2d05427' with '<<CHROOT>>'
I: NOTICE: Log filtering will replace 'build/ruby-shadow-oQXOx8/resolver-EVzf4E' with '<<RESOLVERDIR>>'

+------------------------------------------------------------------------------+
| Update chroot                                                                |
+------------------------------------------------------------------------------+

Get:1 file:/var/mass-rebuild ./ InRelease
Ign:1 file:/var/mass-rebuild ./ InRelease
Get:2 file:/var/mass-rebuild ./ Release [1617 B]
Get:2 file:/var/mass-rebuild ./ Release [1617 B]
Get:3 file:/var/mass-rebuild ./ Release.gpg
Ign:3 file:/var/mass-rebuild ./ Release.gpg
Get:4 http://deb.debian.org/debian unstable InRelease [165 kB]
Get:5 http://incoming.debian.org/debian-buildd buildd-unstable InRelease [39.7 kB]
Get:6 http://deb.debian.org/debian experimental InRelease [75.4 kB]
Get:7 http://deb.debian.org/debian unstable/main Sources.diff/Index [63.6 kB]
Get:8 http://deb.debian.org/debian unstable/main amd64 Packages.diff/Index [63.6 kB]
Get:9 http://deb.debian.org/debian experimental/main amd64 Packages.diff/Index [63.3 kB]
Get:10 http://incoming.debian.org/debian-buildd buildd-unstable/main amd64 Packages [103 kB]
Get:11 http://deb.debian.org/debian unstable/main Sources T-2021-10-04-2005.26-F-2021-10-04-2005.26.pdiff [10.7 kB]
Get:11 http://deb.debian.org/debian unstable/main Sources T-2021-10-04-2005.26-F-2021-10-04-2005.26.pdiff [10.7 kB]
Get:12 http://deb.debian.org/debian unstable/main amd64 Packages T-2021-10-04-2005.26-F-2021-10-04-2005.26.pdiff [12.3 kB]
Get:12 http://deb.debian.org/debian unstable/main amd64 Packages T-2021-10-04-2005.26-F-2021-10-04-2005.26.pdiff [12.3 kB]
Get:13 http://deb.debian.org/debian experimental/main amd64 Packages T-2021-10-04-2005.26-F-2021-10-04-2005.26.pdiff [2755 B]
Get:13 http://deb.debian.org/debian experimental/main amd64 Packages T-2021-10-04-2005.26-F-2021-10-04-2005.26.pdiff [2755 B]
Fetched 599 kB in 3s (221 kB/s)
Reading package lists...
Reading package lists...
Building dependency tree...
Reading state information...
Calculating upgrade...
0 upgraded, 0 newly installed, 0 to remove and 0 not upgraded.

+------------------------------------------------------------------------------+
| Fetch source files                                                           |
+------------------------------------------------------------------------------+


Local sources
-------------

/home/admin/mass-rebuild/builds/3/ruby-shadow/ruby-shadow_2.5.0-1+rebuild1633395333.dsc exists in /home/admin/mass-rebuild/builds/3/ruby-shadow; copying to chroot
I: NOTICE: Log filtering will replace 'build/ruby-shadow-oQXOx8/ruby-shadow-2.5.0' with '<<PKGBUILDDIR>>'
I: NOTICE: Log filtering will replace 'build/ruby-shadow-oQXOx8' with '<<BUILDDIR>>'

+------------------------------------------------------------------------------+
| Install package build dependencies                                           |
+------------------------------------------------------------------------------+


Setup apt archive
-----------------

Merged Build-Depends: debhelper (>= 10), gem2deb, build-essential, fakeroot
Filtered Build-Depends: debhelper (>= 10), gem2deb, build-essential, fakeroot
dpkg-deb: building package 'sbuild-build-depends-main-dummy' in '/<<RESOLVERDIR>>/apt_archive/sbuild-build-depends-main-dummy.deb'.
Ign:1 copy:/<<RESOLVERDIR>>/apt_archive ./ InRelease
Get:2 copy:/<<RESOLVERDIR>>/apt_archive ./ Release [957 B]
Ign:3 copy:/<<RESOLVERDIR>>/apt_archive ./ Release.gpg
Get:4 copy:/<<RESOLVERDIR>>/apt_archive ./ Sources [372 B]
Get:5 copy:/<<RESOLVERDIR>>/apt_archive ./ Packages [451 B]
Fetched 1780 B in 0s (124 kB/s)
Reading package lists...
Reading package lists...

Install main build dependencies (apt-based resolver)
----------------------------------------------------

Installing build dependencies
Reading package lists...
Building dependency tree...
Reading state information...
The following additional packages will be installed:
  autoconf automake autopoint autotools-dev bsdextrautils debhelper devscripts
  dh-autoreconf dh-strip-nondeterminism dirmngr dwz file gem2deb
  gem2deb-test-runner gettext gettext-base gnupg gnupg-l10n gnupg-utils gpg
  gpg-agent gpg-wks-client gpg-wks-server gpgconf gpgsm groff-base
  intltool-debian libarchive-zip-perl libassuan0 libb-hooks-op-check-perl
  libclass-method-modifiers-perl libdebhelper-perl libdevel-callchecker-perl
  libdynaloader-functions-perl libelf1 libencode-locale-perl libexpat1
  libfile-dirlist-perl libfile-homedir-perl libfile-listing-perl
  libfile-stripnondeterminism-perl libfile-touch-perl libfile-which-perl
  libhtml-parser-perl libhtml-tagset-perl libhtml-tree-perl
  libhttp-cookies-perl libhttp-date-perl libhttp-message-perl
  libhttp-negotiate-perl libicu67 libimport-into-perl libio-html-perl
  libio-pty-perl libio-socket-ssl-perl libipc-run-perl libksba8 libldap-2.4-2
  liblwp-mediatypes-perl liblwp-protocol-https-perl libmagic-mgc libmagic1
  libmodule-runtime-perl libmoo-perl libmpdec3 libncursesw6 libnet-http-perl
  libnet-ssleay-perl libnpth0 libparams-classify-perl libpipeline1
  libpython3-stdlib libpython3.9-minimal libpython3.9-stdlib libreadline8
  librole-tiny-perl libsasl2-2 libsasl2-modules-db libsigsegv2 libsqlite3-0
  libsub-override-perl libsub-quote-perl libtimedate-perl libtool
  libtry-tiny-perl libuchardet0 liburi-perl libwww-perl libwww-robotrules-perl
  libxml2 m4 man-db media-types netbase patchutils perl-openssl-defaults
  pinentry-curses po-debconf python3 python3-minimal python3.9
  python3.9-minimal readline-common sensible-utils wdiff
Suggested packages:
  autoconf-archive gnu-standards autoconf-doc dh-make adequate at autopkgtest
  bls-standalone bsd-mailx | mailx check-all-the-things cvs-buildpackage
  devscripts-el diffoscope disorderfs dose-extra duck faketime gnuplot
  how-can-i-help libauthen-sasl-perl libdbd-pg-perl libfile-desktopentry-perl
  libnet-smtps-perl libterm-size-perl libyaml-syck-perl mmdebstrap
  mozilla-devscripts mutt piuparts postgresql-client pristine-lfs quilt ratt
  reprotest ssh-client svn-buildpackage w3m dbus-user-session libpam-systemd
  pinentry-gnome3 tor git-buildpackage pristine-tar gettext-doc
  libasprintf-dev libgettextpo-dev parcimonie xloadimage scdaemon groff
  libdata-dump-perl libcrypt-ssleay-perl libscalar-number-perl libtool-doc
  gfortran | fortran95-compiler gcj-jdk libauthen-ntlm-perl m4-doc apparmor
  less www-browser pinentry-doc libmail-box-perl python3-doc python3-tk
  python3-venv python3.9-venv python3.9-doc binfmt-support readline-doc
  wdiff-doc
Recommended packages:
  dctrl-tools dput | dupload libdistro-info-perl libgit-wrapper-perl
  libgitlab-api-v4-perl liblist-compare-perl libstring-shellquote-perl
  licensecheck lintian pristine-tar python3-apt python3-debian python3-magic
  python3-requests python3-unidiff python3-xdg strace unzip wget | curl
  debian-keyring equivs libsoap-lite-perl apt-file curl | wget | lynx
  libarchive-cpio-perl libhtml-format-perl libclone-perl libldap-common
  libclass-xsaccessor-perl libnamespace-clean-perl libgpm2 libsasl2-modules
  libltdl-dev libdata-dump-perl libhtml-form-perl libhttp-daemon-perl
  libmailtools-perl libmail-sendmail-perl
The following NEW packages will be installed:
  autoconf automake autopoint autotools-dev bsdextrautils debhelper devscripts
  dh-autoreconf dh-strip-nondeterminism dirmngr dwz file gem2deb
  gem2deb-test-runner gettext gettext-base gnupg gnupg-l10n gnupg-utils gpg
  gpg-agent gpg-wks-client gpg-wks-server gpgconf gpgsm groff-base
  intltool-debian libarchive-zip-perl libassuan0 libb-hooks-op-check-perl
  libclass-method-modifiers-perl libdebhelper-perl libdevel-callchecker-perl
  libdynaloader-functions-perl libelf1 libencode-locale-perl libexpat1
  libfile-dirlist-perl libfile-homedir-perl libfile-listing-perl
  libfile-stripnondeterminism-perl libfile-touch-perl libfile-which-perl
  libhtml-parser-perl libhtml-tagset-perl libhtml-tree-perl
  libhttp-cookies-perl libhttp-date-perl libhttp-message-perl
  libhttp-negotiate-perl libicu67 libimport-into-perl libio-html-perl
  libio-pty-perl libio-socket-ssl-perl libipc-run-perl libksba8 libldap-2.4-2
  liblwp-mediatypes-perl liblwp-protocol-https-perl libmagic-mgc libmagic1
  libmodule-runtime-perl libmoo-perl libmpdec3 libncursesw6 libnet-http-perl
  libnet-ssleay-perl libnpth0 libparams-classify-perl libpipeline1
  libpython3-stdlib libpython3.9-minimal libpython3.9-stdlib libreadline8
  librole-tiny-perl libsasl2-2 libsasl2-modules-db libsigsegv2 libsqlite3-0
  libsub-override-perl libsub-quote-perl libtimedate-perl libtool
  libtry-tiny-perl libuchardet0 liburi-perl libwww-perl libwww-robotrules-perl
  libxml2 m4 man-db media-types netbase patchutils perl-openssl-defaults
  pinentry-curses po-debconf python3 python3-minimal python3.9
  python3.9-minimal readline-common sbuild-build-depends-main-dummy
  sensible-utils wdiff
0 upgraded, 106 newly installed, 0 to remove and 0 not upgraded.
Need to get 36.1 MB of archives.
After this operation, 117 MB of additional disk space will be used.
Get:1 copy:/<<RESOLVERDIR>>/apt_archive ./ sbuild-build-depends-main-dummy 0.invalid.0 [880 B]
Get:2 http://deb.debian.org/debian unstable/main amd64 bsdextrautils amd64 2.37.2-3 [143 kB]
Get:3 http://deb.debian.org/debian unstable/main amd64 libuchardet0 amd64 0.0.7-1 [67.8 kB]
Get:4 http://deb.debian.org/debian unstable/main amd64 groff-base amd64 1.22.4-7 [935 kB]
Get:5 http://deb.debian.org/debian unstable/main amd64 libpipeline1 amd64 1.5.3-1 [34.3 kB]
Get:6 http://deb.debian.org/debian unstable/main amd64 man-db amd64 2.9.4-2 [1354 kB]
Get:7 http://deb.debian.org/debian unstable/main amd64 libpython3.9-minimal amd64 3.9.7-4 [804 kB]
Get:8 http://deb.debian.org/debian unstable/main amd64 libexpat1 amd64 2.4.1-2+b1 [104 kB]
Get:9 http://deb.debian.org/debian unstable/main amd64 python3.9-minimal amd64 3.9.7-4 [1963 kB]
Get:10 http://deb.debian.org/debian unstable/main amd64 python3-minimal amd64 3.9.2-3 [38.2 kB]
Get:11 http://deb.debian.org/debian unstable/main amd64 media-types all 4.0.0 [30.3 kB]
Get:12 http://deb.debian.org/debian unstable/main amd64 libmpdec3 amd64 2.5.1-2 [87.8 kB]
Get:13 http://deb.debian.org/debian unstable/main amd64 libncursesw6 amd64 6.2+20210905-1 [133 kB]
Get:14 http://deb.debian.org/debian unstable/main amd64 readline-common all 8.1-2 [73.8 kB]
Get:15 http://deb.debian.org/debian unstable/main amd64 libreadline8 amd64 8.1-2 [168 kB]
Get:16 http://deb.debian.org/debian unstable/main amd64 libsqlite3-0 amd64 3.36.0-2 [815 kB]
Get:17 http://deb.debian.org/debian unstable/main amd64 libpython3.9-stdlib amd64 3.9.7-4 [1688 kB]
Get:18 http://deb.debian.org/debian unstable/main amd64 python3.9 amd64 3.9.7-4 [480 kB]
Get:19 http://deb.debian.org/debian unstable/main amd64 libpython3-stdlib amd64 3.9.2-3 [21.4 kB]
Get:20 http://deb.debian.org/debian unstable/main amd64 python3 amd64 3.9.2-3 [37.9 kB]
Get:21 http://deb.debian.org/debian unstable/main amd64 netbase all 6.3 [19.9 kB]
Get:22 http://deb.debian.org/debian unstable/main amd64 sensible-utils all 0.0.17 [21.5 kB]
Get:23 http://deb.debian.org/debian unstable/main amd64 libmagic-mgc amd64 1:5.39-3 [273 kB]
Get:24 http://deb.debian.org/debian unstable/main amd64 libmagic1 amd64 1:5.39-3 [126 kB]
Get:25 http://deb.debian.org/debian unstable/main amd64 file amd64 1:5.39-3 [69.1 kB]
Get:26 http://deb.debian.org/debian unstable/main amd64 gettext-base amd64 0.21-4 [175 kB]
Get:27 http://deb.debian.org/debian unstable/main amd64 libsigsegv2 amd64 2.13-1 [34.8 kB]
Get:28 http://deb.debian.org/debian unstable/main amd64 m4 amd64 1.4.18-5 [204 kB]
Get:29 http://deb.debian.org/debian unstable/main amd64 autoconf all 2.71-2 [343 kB]
Get:30 http://deb.debian.org/debian unstable/main amd64 autotools-dev all 20180224.1+nmu1 [77.1 kB]
Get:31 http://deb.debian.org/debian unstable/main amd64 automake all 1:1.16.4-2 [819 kB]
Get:32 http://deb.debian.org/debian unstable/main amd64 autopoint all 0.21-4 [510 kB]
Get:33 http://deb.debian.org/debian unstable/main amd64 libdebhelper-perl all 13.5.2 [192 kB]
Get:34 http://deb.debian.org/debian unstable/main amd64 libtool all 2.4.6-15 [513 kB]
Get:35 http://deb.debian.org/debian unstable/main amd64 dh-autoreconf all 20 [17.1 kB]
Get:36 http://deb.debian.org/debian unstable/main amd64 libarchive-zip-perl all 1.68-1 [104 kB]
Get:37 http://deb.debian.org/debian unstable/main amd64 libsub-override-perl all 0.09-2 [10.2 kB]
Get:38 http://deb.debian.org/debian unstable/main amd64 libfile-stripnondeterminism-perl all 1.12.0-1 [26.3 kB]
Get:39 http://deb.debian.org/debian unstable/main amd64 dh-strip-nondeterminism all 1.12.0-1 [15.4 kB]
Get:40 http://deb.debian.org/debian unstable/main amd64 libelf1 amd64 0.185-2 [172 kB]
Get:41 http://deb.debian.org/debian unstable/main amd64 dwz amd64 0.14-1 [98.3 kB]
Get:42 http://deb.debian.org/debian unstable/main amd64 libicu67 amd64 67.1-7 [8622 kB]
Get:43 http://deb.debian.org/debian unstable/main amd64 libxml2 amd64 2.9.12+dfsg-5 [696 kB]
Get:44 http://deb.debian.org/debian unstable/main amd64 gettext amd64 0.21-4 [1311 kB]
Get:45 http://deb.debian.org/debian unstable/main amd64 intltool-debian all 0.35.0+20060710.5 [26.8 kB]
Get:46 http://deb.debian.org/debian unstable/main amd64 po-debconf all 1.0.21+nmu1 [248 kB]
Get:47 http://deb.debian.org/debian unstable/main amd64 debhelper all 13.5.2 [1056 kB]
Get:48 http://deb.debian.org/debian unstable/main amd64 libassuan0 amd64 2.5.5-1 [51.8 kB]
Get:49 http://deb.debian.org/debian unstable/main amd64 gpgconf amd64 2.2.27-2 [547 kB]
Get:50 http://deb.debian.org/debian unstable/main amd64 libksba8 amd64 1.6.0-2 [127 kB]
Get:51 http://deb.debian.org/debian unstable/main amd64 libsasl2-modules-db amd64 2.1.27+dfsg-2.1 [69.1 kB]
Get:52 http://deb.debian.org/debian unstable/main amd64 libsasl2-2 amd64 2.1.27+dfsg-2.1 [106 kB]
Get:53 http://deb.debian.org/debian unstable/main amd64 libldap-2.4-2 amd64 2.4.59+dfsg-1 [232 kB]
Get:54 http://deb.debian.org/debian unstable/main amd64 libnpth0 amd64 1.6-3 [19.0 kB]
Get:55 http://deb.debian.org/debian unstable/main amd64 dirmngr amd64 2.2.27-2 [762 kB]
Get:56 http://deb.debian.org/debian unstable/main amd64 gnupg-l10n all 2.2.27-2 [1084 kB]
Get:57 http://deb.debian.org/debian unstable/main amd64 gnupg-utils amd64 2.2.27-2 [905 kB]
Get:58 http://deb.debian.org/debian unstable/main amd64 gpg amd64 2.2.27-2 [927 kB]
Get:59 http://deb.debian.org/debian unstable/main amd64 pinentry-curses amd64 1.1.0-4 [64.9 kB]
Get:60 http://deb.debian.org/debian unstable/main amd64 gpg-agent amd64 2.2.27-2 [669 kB]
Get:61 http://deb.debian.org/debian unstable/main amd64 gpg-wks-client amd64 2.2.27-2 [523 kB]
Get:62 http://deb.debian.org/debian unstable/main amd64 gpg-wks-server amd64 2.2.27-2 [516 kB]
Get:63 http://deb.debian.org/debian unstable/main amd64 gpgsm amd64 2.2.27-2 [645 kB]
Get:64 http://deb.debian.org/debian unstable/main amd64 gnupg all 2.2.27-2 [825 kB]
Get:65 http://deb.debian.org/debian unstable/main amd64 libfile-dirlist-perl all 0.05-2 [7444 B]
Get:66 http://deb.debian.org/debian unstable/main amd64 libfile-which-perl all 1.23-1 [16.6 kB]
Get:67 http://deb.debian.org/debian unstable/main amd64 libfile-homedir-perl all 1.006-1 [43.8 kB]
Get:68 http://deb.debian.org/debian unstable/main amd64 libfile-touch-perl all 0.12-1 [10.5 kB]
Get:69 http://deb.debian.org/debian unstable/main amd64 libio-pty-perl amd64 1:1.15-2 [37.0 kB]
Get:70 http://deb.debian.org/debian unstable/main amd64 libipc-run-perl all 20200505.0-1 [102 kB]
Get:71 http://deb.debian.org/debian unstable/main amd64 libclass-method-modifiers-perl all 2.13-1 [19.2 kB]
Get:72 http://deb.debian.org/debian unstable/main amd64 libb-hooks-op-check-perl amd64 0.22-1+b3 [11.3 kB]
Get:73 http://deb.debian.org/debian unstable/main amd64 libdynaloader-functions-perl all 0.003-1.1 [12.7 kB]
Get:74 http://deb.debian.org/debian unstable/main amd64 libdevel-callchecker-perl amd64 0.008-1+b2 [15.9 kB]
Get:75 http://deb.debian.org/debian unstable/main amd64 libparams-classify-perl amd64 0.015-1+b3 [25.7 kB]
Get:76 http://deb.debian.org/debian unstable/main amd64 libmodule-runtime-perl all 0.016-1 [19.4 kB]
Get:77 http://deb.debian.org/debian unstable/main amd64 libimport-into-perl all 1.002005-1 [11.6 kB]
Get:78 http://deb.debian.org/debian unstable/main amd64 librole-tiny-perl all 2.002004-1 [21.4 kB]
Get:79 http://deb.debian.org/debian unstable/main amd64 libsub-quote-perl all 2.006006-1 [21.0 kB]
Get:80 http://deb.debian.org/debian unstable/main amd64 libmoo-perl all 2.005004-2 [60.4 kB]
Get:81 http://deb.debian.org/debian unstable/main amd64 libencode-locale-perl all 1.05-1.1 [13.2 kB]
Get:82 http://deb.debian.org/debian unstable/main amd64 libtimedate-perl all 2.3300-2 [39.3 kB]
Get:83 http://deb.debian.org/debian unstable/main amd64 libhttp-date-perl all 6.05-1 [10.4 kB]
Get:84 http://deb.debian.org/debian unstable/main amd64 libfile-listing-perl all 6.14-1 [12.4 kB]
Get:85 http://deb.debian.org/debian unstable/main amd64 libhtml-tagset-perl all 3.20-4 [13.0 kB]
Get:86 http://deb.debian.org/debian unstable/main amd64 liburi-perl all 5.08-1 [90.6 kB]
Get:87 http://deb.debian.org/debian unstable/main amd64 libhtml-parser-perl amd64 3.76-1 [105 kB]
Get:88 http://deb.debian.org/debian unstable/main amd64 libhtml-tree-perl all 5.07-2 [213 kB]
Get:89 http://deb.debian.org/debian unstable/main amd64 libio-html-perl all 1.004-2 [16.1 kB]
Get:90 http://deb.debian.org/debian unstable/main amd64 liblwp-mediatypes-perl all 6.04-1 [19.9 kB]
Get:91 http://deb.debian.org/debian unstable/main amd64 libhttp-message-perl all 6.33-1 [80.1 kB]
Get:92 http://deb.debian.org/debian unstable/main amd64 libhttp-cookies-perl all 6.10-1 [19.6 kB]
Get:93 http://deb.debian.org/debian unstable/main amd64 libhttp-negotiate-perl all 6.01-1 [12.8 kB]
Get:94 http://deb.debian.org/debian unstable/main amd64 perl-openssl-defaults amd64 5 [7360 B]
Get:95 http://deb.debian.org/debian unstable/main amd64 libnet-ssleay-perl amd64 1.88-3+b1 [321 kB]
Get:96 http://deb.debian.org/debian unstable/main amd64 libio-socket-ssl-perl all 2.072-1 [221 kB]
Get:97 http://deb.debian.org/debian unstable/main amd64 libnet-http-perl all 6.21-1 [25.3 kB]
Get:98 http://deb.debian.org/debian unstable/main amd64 liblwp-protocol-https-perl all 6.10-1 [12.2 kB]
Get:99 http://deb.debian.org/debian unstable/main amd64 libtry-tiny-perl all 0.30-1 [23.3 kB]
Get:100 http://deb.debian.org/debian unstable/main amd64 libwww-robotrules-perl all 6.02-1 [12.9 kB]
Get:101 http://deb.debian.org/debian unstable/main amd64 libwww-perl all 6.53-1 [192 kB]
Get:102 http://deb.debian.org/debian unstable/main amd64 patchutils amd64 0.4.2-1 [77.5 kB]
Get:103 http://deb.debian.org/debian unstable/main amd64 wdiff amd64 1.2.2-2+b1 [122 kB]
Get:104 http://deb.debian.org/debian unstable/main amd64 devscripts amd64 2.21.4 [1093 kB]
Get:105 http://deb.debian.org/debian unstable/main amd64 gem2deb-test-runner amd64 1.4 [26.2 kB]
Get:106 http://deb.debian.org/debian unstable/main amd64 gem2deb amd64 1.4 [62.1 kB]
debconf: delaying package configuration, since apt-utils is not installed
Fetched 36.1 MB in 1s (27.6 MB/s)
Selecting previously unselected package bsdextrautils.
(Reading database ... 17588 files and directories currently installed.)
Preparing to unpack .../0-bsdextrautils_2.37.2-3_amd64.deb ...
Unpacking bsdextrautils (2.37.2-3) ...
Selecting previously unselected package libuchardet0:amd64.
Preparing to unpack .../1-libuchardet0_0.0.7-1_amd64.deb ...
Unpacking libuchardet0:amd64 (0.0.7-1) ...
Selecting previously unselected package groff-base.
Preparing to unpack .../2-groff-base_1.22.4-7_amd64.deb ...
Unpacking groff-base (1.22.4-7) ...
Selecting previously unselected package libpipeline1:amd64.
Preparing to unpack .../3-libpipeline1_1.5.3-1_amd64.deb ...
Unpacking libpipeline1:amd64 (1.5.3-1) ...
Selecting previously unselected package man-db.
Preparing to unpack .../4-man-db_2.9.4-2_amd64.deb ...
Unpacking man-db (2.9.4-2) ...
Selecting previously unselected package libpython3.9-minimal:amd64.
Preparing to unpack .../5-libpython3.9-minimal_3.9.7-4_amd64.deb ...
Unpacking libpython3.9-minimal:amd64 (3.9.7-4) ...
Selecting previously unselected package libexpat1:amd64.
Preparing to unpack .../6-libexpat1_2.4.1-2+b1_amd64.deb ...
Unpacking libexpat1:amd64 (2.4.1-2+b1) ...
Selecting previously unselected package python3.9-minimal.
Preparing to unpack .../7-python3.9-minimal_3.9.7-4_amd64.deb ...
Unpacking python3.9-minimal (3.9.7-4) ...
Setting up libpython3.9-minimal:amd64 (3.9.7-4) ...
Setting up libexpat1:amd64 (2.4.1-2+b1) ...
Setting up python3.9-minimal (3.9.7-4) ...
Selecting previously unselected package python3-minimal.
(Reading database ... 18457 files and directories currently installed.)
Preparing to unpack .../0-python3-minimal_3.9.2-3_amd64.deb ...
Unpacking python3-minimal (3.9.2-3) ...
Selecting previously unselected package media-types.
Preparing to unpack .../1-media-types_4.0.0_all.deb ...
Unpacking media-types (4.0.0) ...
Selecting previously unselected package libmpdec3:amd64.
Preparing to unpack .../2-libmpdec3_2.5.1-2_amd64.deb ...
Unpacking libmpdec3:amd64 (2.5.1-2) ...
Selecting previously unselected package libncursesw6:amd64.
Preparing to unpack .../3-libncursesw6_6.2+20210905-1_amd64.deb ...
Unpacking libncursesw6:amd64 (6.2+20210905-1) ...
Selecting previously unselected package readline-common.
Preparing to unpack .../4-readline-common_8.1-2_all.deb ...
Unpacking readline-common (8.1-2) ...
Selecting previously unselected package libreadline8:amd64.
Preparing to unpack .../5-libreadline8_8.1-2_amd64.deb ...
Unpacking libreadline8:amd64 (8.1-2) ...
Selecting previously unselected package libsqlite3-0:amd64.
Preparing to unpack .../6-libsqlite3-0_3.36.0-2_amd64.deb ...
Unpacking libsqlite3-0:amd64 (3.36.0-2) ...
Selecting previously unselected package libpython3.9-stdlib:amd64.
Preparing to unpack .../7-libpython3.9-stdlib_3.9.7-4_amd64.deb ...
Unpacking libpython3.9-stdlib:amd64 (3.9.7-4) ...
Selecting previously unselected package python3.9.
Preparing to unpack .../8-python3.9_3.9.7-4_amd64.deb ...
Unpacking python3.9 (3.9.7-4) ...
Selecting previously unselected package libpython3-stdlib:amd64.
Preparing to unpack .../9-libpython3-stdlib_3.9.2-3_amd64.deb ...
Unpacking libpython3-stdlib:amd64 (3.9.2-3) ...
Setting up python3-minimal (3.9.2-3) ...
Selecting previously unselected package python3.
(Reading database ... 18896 files and directories currently installed.)
Preparing to unpack .../00-python3_3.9.2-3_amd64.deb ...
Unpacking python3 (3.9.2-3) ...
Selecting previously unselected package netbase.
Preparing to unpack .../01-netbase_6.3_all.deb ...
Unpacking netbase (6.3) ...
Selecting previously unselected package sensible-utils.
Preparing to unpack .../02-sensible-utils_0.0.17_all.deb ...
Unpacking sensible-utils (0.0.17) ...
Selecting previously unselected package libmagic-mgc.
Preparing to unpack .../03-libmagic-mgc_1%3a5.39-3_amd64.deb ...
Unpacking libmagic-mgc (1:5.39-3) ...
Selecting previously unselected package libmagic1:amd64.
Preparing to unpack .../04-libmagic1_1%3a5.39-3_amd64.deb ...
Unpacking libmagic1:amd64 (1:5.39-3) ...
Selecting previously unselected package file.
Preparing to unpack .../05-file_1%3a5.39-3_amd64.deb ...
Unpacking file (1:5.39-3) ...
Selecting previously unselected package gettext-base.
Preparing to unpack .../06-gettext-base_0.21-4_amd64.deb ...
Unpacking gettext-base (0.21-4) ...
Selecting previously unselected package libsigsegv2:amd64.
Preparing to unpack .../07-libsigsegv2_2.13-1_amd64.deb ...
Unpacking libsigsegv2:amd64 (2.13-1) ...
Selecting previously unselected package m4.
Preparing to unpack .../08-m4_1.4.18-5_amd64.deb ...
Unpacking m4 (1.4.18-5) ...
Selecting previously unselected package autoconf.
Preparing to unpack .../09-autoconf_2.71-2_all.deb ...
Unpacking autoconf (2.71-2) ...
Selecting previously unselected package autotools-dev.
Preparing to unpack .../10-autotools-dev_20180224.1+nmu1_all.deb ...
Unpacking autotools-dev (20180224.1+nmu1) ...
Selecting previously unselected package automake.
Preparing to unpack .../11-automake_1%3a1.16.4-2_all.deb ...
Unpacking automake (1:1.16.4-2) ...
Selecting previously unselected package autopoint.
Preparing to unpack .../12-autopoint_0.21-4_all.deb ...
Unpacking autopoint (0.21-4) ...
Selecting previously unselected package libdebhelper-perl.
Preparing to unpack .../13-libdebhelper-perl_13.5.2_all.deb ...
Unpacking libdebhelper-perl (13.5.2) ...
Selecting previously unselected package libtool.
Preparing to unpack .../14-libtool_2.4.6-15_all.deb ...
Unpacking libtool (2.4.6-15) ...
Selecting previously unselected package dh-autoreconf.
Preparing to unpack .../15-dh-autoreconf_20_all.deb ...
Unpacking dh-autoreconf (20) ...
Selecting previously unselected package libarchive-zip-perl.
Preparing to unpack .../16-libarchive-zip-perl_1.68-1_all.deb ...
Unpacking libarchive-zip-perl (1.68-1) ...
Selecting previously unselected package libsub-override-perl.
Preparing to unpack .../17-libsub-override-perl_0.09-2_all.deb ...
Unpacking libsub-override-perl (0.09-2) ...
Selecting previously unselected package libfile-stripnondeterminism-perl.
Preparing to unpack .../18-libfile-stripnondeterminism-perl_1.12.0-1_all.deb ...
Unpacking libfile-stripnondeterminism-perl (1.12.0-1) ...
Selecting previously unselected package dh-strip-nondeterminism.
Preparing to unpack .../19-dh-strip-nondeterminism_1.12.0-1_all.deb ...
Unpacking dh-strip-nondeterminism (1.12.0-1) ...
Selecting previously unselected package libelf1:amd64.
Preparing to unpack .../20-libelf1_0.185-2_amd64.deb ...
Unpacking libelf1:amd64 (0.185-2) ...
Selecting previously unselected package dwz.
Preparing to unpack .../21-dwz_0.14-1_amd64.deb ...
Unpacking dwz (0.14-1) ...
Selecting previously unselected package libicu67:amd64.
Preparing to unpack .../22-libicu67_67.1-7_amd64.deb ...
Unpacking libicu67:amd64 (67.1-7) ...
Selecting previously unselected package libxml2:amd64.
Preparing to unpack .../23-libxml2_2.9.12+dfsg-5_amd64.deb ...
Unpacking libxml2:amd64 (2.9.12+dfsg-5) ...
Selecting previously unselected package gettext.
Preparing to unpack .../24-gettext_0.21-4_amd64.deb ...
Unpacking gettext (0.21-4) ...
Selecting previously unselected package intltool-debian.
Preparing to unpack .../25-intltool-debian_0.35.0+20060710.5_all.deb ...
Unpacking intltool-debian (0.35.0+20060710.5) ...
Selecting previously unselected package po-debconf.
Preparing to unpack .../26-po-debconf_1.0.21+nmu1_all.deb ...
Unpacking po-debconf (1.0.21+nmu1) ...
Selecting previously unselected package debhelper.
Preparing to unpack .../27-debhelper_13.5.2_all.deb ...
Unpacking debhelper (13.5.2) ...
Selecting previously unselected package libassuan0:amd64.
Preparing to unpack .../28-libassuan0_2.5.5-1_amd64.deb ...
Unpacking libassuan0:amd64 (2.5.5-1) ...
Selecting previously unselected package gpgconf.
Preparing to unpack .../29-gpgconf_2.2.27-2_amd64.deb ...
Unpacking gpgconf (2.2.27-2) ...
Selecting previously unselected package libksba8:amd64.
Preparing to unpack .../30-libksba8_1.6.0-2_amd64.deb ...
Unpacking libksba8:amd64 (1.6.0-2) ...
Selecting previously unselected package libsasl2-modules-db:amd64.
Preparing to unpack .../31-libsasl2-modules-db_2.1.27+dfsg-2.1_amd64.deb ...
Unpacking libsasl2-modules-db:amd64 (2.1.27+dfsg-2.1) ...
Selecting previously unselected package libsasl2-2:amd64.
Preparing to unpack .../32-libsasl2-2_2.1.27+dfsg-2.1_amd64.deb ...
Unpacking libsasl2-2:amd64 (2.1.27+dfsg-2.1) ...
Selecting previously unselected package libldap-2.4-2:amd64.
Preparing to unpack .../33-libldap-2.4-2_2.4.59+dfsg-1_amd64.deb ...
Unpacking libldap-2.4-2:amd64 (2.4.59+dfsg-1) ...
Selecting previously unselected package libnpth0:amd64.
Preparing to unpack .../34-libnpth0_1.6-3_amd64.deb ...
Unpacking libnpth0:amd64 (1.6-3) ...
Selecting previously unselected package dirmngr.
Preparing to unpack .../35-dirmngr_2.2.27-2_amd64.deb ...
Unpacking dirmngr (2.2.27-2) ...
Selecting previously unselected package gnupg-l10n.
Preparing to unpack .../36-gnupg-l10n_2.2.27-2_all.deb ...
Unpacking gnupg-l10n (2.2.27-2) ...
Selecting previously unselected package gnupg-utils.
Preparing to unpack .../37-gnupg-utils_2.2.27-2_amd64.deb ...
Unpacking gnupg-utils (2.2.27-2) ...
Selecting previously unselected package gpg.
Preparing to unpack .../38-gpg_2.2.27-2_amd64.deb ...
Unpacking gpg (2.2.27-2) ...
Selecting previously unselected package pinentry-curses.
Preparing to unpack .../39-pinentry-curses_1.1.0-4_amd64.deb ...
Unpacking pinentry-curses (1.1.0-4) ...
Selecting previously unselected package gpg-agent.
Preparing to unpack .../40-gpg-agent_2.2.27-2_amd64.deb ...
Unpacking gpg-agent (2.2.27-2) ...
Selecting previously unselected package gpg-wks-client.
Preparing to unpack .../41-gpg-wks-client_2.2.27-2_amd64.deb ...
Unpacking gpg-wks-client (2.2.27-2) ...
Selecting previously unselected package gpg-wks-server.
Preparing to unpack .../42-gpg-wks-server_2.2.27-2_amd64.deb ...
Unpacking gpg-wks-server (2.2.27-2) ...
Selecting previously unselected package gpgsm.
Preparing to unpack .../43-gpgsm_2.2.27-2_amd64.deb ...
Unpacking gpgsm (2.2.27-2) ...
Selecting previously unselected package gnupg.
Preparing to unpack .../44-gnupg_2.2.27-2_all.deb ...
Unpacking gnupg (2.2.27-2) ...
Selecting previously unselected package libfile-dirlist-perl.
Preparing to unpack .../45-libfile-dirlist-perl_0.05-2_all.deb ...
Unpacking libfile-dirlist-perl (0.05-2) ...
Selecting previously unselected package libfile-which-perl.
Preparing to unpack .../46-libfile-which-perl_1.23-1_all.deb ...
Unpacking libfile-which-perl (1.23-1) ...
Selecting previously unselected package libfile-homedir-perl.
Preparing to unpack .../47-libfile-homedir-perl_1.006-1_all.deb ...
Unpacking libfile-homedir-perl (1.006-1) ...
Selecting previously unselected package libfile-touch-perl.
Preparing to unpack .../48-libfile-touch-perl_0.12-1_all.deb ...
Unpacking libfile-touch-perl (0.12-1) ...
Selecting previously unselected package libio-pty-perl.
Preparing to unpack .../49-libio-pty-perl_1%3a1.15-2_amd64.deb ...
Unpacking libio-pty-perl (1:1.15-2) ...
Selecting previously unselected package libipc-run-perl.
Preparing to unpack .../50-libipc-run-perl_20200505.0-1_all.deb ...
Unpacking libipc-run-perl (20200505.0-1) ...
Selecting previously unselected package libclass-method-modifiers-perl.
Preparing to unpack .../51-libclass-method-modifiers-perl_2.13-1_all.deb ...
Unpacking libclass-method-modifiers-perl (2.13-1) ...
Selecting previously unselected package libb-hooks-op-check-perl.
Preparing to unpack .../52-libb-hooks-op-check-perl_0.22-1+b3_amd64.deb ...
Unpacking libb-hooks-op-check-perl (0.22-1+b3) ...
Selecting previously unselected package libdynaloader-functions-perl.
Preparing to unpack .../53-libdynaloader-functions-perl_0.003-1.1_all.deb ...
Unpacking libdynaloader-functions-perl (0.003-1.1) ...
Selecting previously unselected package libdevel-callchecker-perl.
Preparing to unpack .../54-libdevel-callchecker-perl_0.008-1+b2_amd64.deb ...
Unpacking libdevel-callchecker-perl (0.008-1+b2) ...
Selecting previously unselected package libparams-classify-perl.
Preparing to unpack .../55-libparams-classify-perl_0.015-1+b3_amd64.deb ...
Unpacking libparams-classify-perl (0.015-1+b3) ...
Selecting previously unselected package libmodule-runtime-perl.
Preparing to unpack .../56-libmodule-runtime-perl_0.016-1_all.deb ...
Unpacking libmodule-runtime-perl (0.016-1) ...
Selecting previously unselected package libimport-into-perl.
Preparing to unpack .../57-libimport-into-perl_1.002005-1_all.deb ...
Unpacking libimport-into-perl (1.002005-1) ...
Selecting previously unselected package librole-tiny-perl.
Preparing to unpack .../58-librole-tiny-perl_2.002004-1_all.deb ...
Unpacking librole-tiny-perl (2.002004-1) ...
Selecting previously unselected package libsub-quote-perl.
Preparing to unpack .../59-libsub-quote-perl_2.006006-1_all.deb ...
Unpacking libsub-quote-perl (2.006006-1) ...
Selecting previously unselected package libmoo-perl.
Preparing to unpack .../60-libmoo-perl_2.005004-2_all.deb ...
Unpacking libmoo-perl (2.005004-2) ...
Selecting previously unselected package libencode-locale-perl.
Preparing to unpack .../61-libencode-locale-perl_1.05-1.1_all.deb ...
Unpacking libencode-locale-perl (1.05-1.1) ...
Selecting previously unselected package libtimedate-perl.
Preparing to unpack .../62-libtimedate-perl_2.3300-2_all.deb ...
Unpacking libtimedate-perl (2.3300-2) ...
Selecting previously unselected package libhttp-date-perl.
Preparing to unpack .../63-libhttp-date-perl_6.05-1_all.deb ...
Unpacking libhttp-date-perl (6.05-1) ...
Selecting previously unselected package libfile-listing-perl.
Preparing to unpack .../64-libfile-listing-perl_6.14-1_all.deb ...
Unpacking libfile-listing-perl (6.14-1) ...
Selecting previously unselected package libhtml-tagset-perl.
Preparing to unpack .../65-libhtml-tagset-perl_3.20-4_all.deb ...
Unpacking libhtml-tagset-perl (3.20-4) ...
Selecting previously unselected package liburi-perl.
Preparing to unpack .../66-liburi-perl_5.08-1_all.deb ...
Unpacking liburi-perl (5.08-1) ...
Selecting previously unselected package libhtml-parser-perl:amd64.
Preparing to unpack .../67-libhtml-parser-perl_3.76-1_amd64.deb ...
Unpacking libhtml-parser-perl:amd64 (3.76-1) ...
Selecting previously unselected package libhtml-tree-perl.
Preparing to unpack .../68-libhtml-tree-perl_5.07-2_all.deb ...
Unpacking libhtml-tree-perl (5.07-2) ...
Selecting previously unselected package libio-html-perl.
Preparing to unpack .../69-libio-html-perl_1.004-2_all.deb ...
Unpacking libio-html-perl (1.004-2) ...
Selecting previously unselected package liblwp-mediatypes-perl.
Preparing to unpack .../70-liblwp-mediatypes-perl_6.04-1_all.deb ...
Unpacking liblwp-mediatypes-perl (6.04-1) ...
Selecting previously unselected package libhttp-message-perl.
Preparing to unpack .../71-libhttp-message-perl_6.33-1_all.deb ...
Unpacking libhttp-message-perl (6.33-1) ...
Selecting previously unselected package libhttp-cookies-perl.
Preparing to unpack .../72-libhttp-cookies-perl_6.10-1_all.deb ...
Unpacking libhttp-cookies-perl (6.10-1) ...
Selecting previously unselected package libhttp-negotiate-perl.
Preparing to unpack .../73-libhttp-negotiate-perl_6.01-1_all.deb ...
Unpacking libhttp-negotiate-perl (6.01-1) ...
Selecting previously unselected package perl-openssl-defaults:amd64.
Preparing to unpack .../74-perl-openssl-defaults_5_amd64.deb ...
Unpacking perl-openssl-defaults:amd64 (5) ...
Selecting previously unselected package libnet-ssleay-perl.
Preparing to unpack .../75-libnet-ssleay-perl_1.88-3+b1_amd64.deb ...
Unpacking libnet-ssleay-perl (1.88-3+b1) ...
Selecting previously unselected package libio-socket-ssl-perl.
Preparing to unpack .../76-libio-socket-ssl-perl_2.072-1_all.deb ...
Unpacking libio-socket-ssl-perl (2.072-1) ...
Selecting previously unselected package libnet-http-perl.
Preparing to unpack .../77-libnet-http-perl_6.21-1_all.deb ...
Unpacking libnet-http-perl (6.21-1) ...
Selecting previously unselected package liblwp-protocol-https-perl.
Preparing to unpack .../78-liblwp-protocol-https-perl_6.10-1_all.deb ...
Unpacking liblwp-protocol-https-perl (6.10-1) ...
Selecting previously unselected package libtry-tiny-perl.
Preparing to unpack .../79-libtry-tiny-perl_0.30-1_all.deb ...
Unpacking libtry-tiny-perl (0.30-1) ...
Selecting previously unselected package libwww-robotrules-perl.
Preparing to unpack .../80-libwww-robotrules-perl_6.02-1_all.deb ...
Unpacking libwww-robotrules-perl (6.02-1) ...
Selecting previously unselected package libwww-perl.
Preparing to unpack .../81-libwww-perl_6.53-1_all.deb ...
Unpacking libwww-perl (6.53-1) ...
Selecting previously unselected package patchutils.
Preparing to unpack .../82-patchutils_0.4.2-1_amd64.deb ...
Unpacking patchutils (0.4.2-1) ...
Selecting previously unselected package wdiff.
Preparing to unpack .../83-wdiff_1.2.2-2+b1_amd64.deb ...
Unpacking wdiff (1.2.2-2+b1) ...
Selecting previously unselected package devscripts.
Preparing to unpack .../84-devscripts_2.21.4_amd64.deb ...
Unpacking devscripts (2.21.4) ...
Selecting previously unselected package gem2deb-test-runner.
Preparing to unpack .../85-gem2deb-test-runner_1.4_amd64.deb ...
Unpacking gem2deb-test-runner (1.4) ...
Selecting previously unselected package gem2deb.
Preparing to unpack .../86-gem2deb_1.4_amd64.deb ...
Unpacking gem2deb (1.4) ...
Selecting previously unselected package sbuild-build-depends-main-dummy.
Preparing to unpack .../87-sbuild-build-depends-main-dummy_0.invalid.0_amd64.deb ...
Unpacking sbuild-build-depends-main-dummy (0.invalid.0) ...
Setting up libksba8:amd64 (1.6.0-2) ...
Setting up media-types (4.0.0) ...
Setting up libpipeline1:amd64 (1.5.3-1) ...
Setting up wdiff (1.2.2-2+b1) ...
Setting up libfile-which-perl (1.23-1) ...
Setting up bsdextrautils (2.37.2-3) ...
update-alternatives: using /usr/bin/write.ul to provide /usr/bin/write (write) in auto mode
Setting up libicu67:amd64 (67.1-7) ...
Setting up libdynaloader-functions-perl (0.003-1.1) ...
Setting up libclass-method-modifiers-perl (2.13-1) ...
Setting up libio-pty-perl (1:1.15-2) ...
Setting up libmagic-mgc (1:5.39-3) ...
Setting up libarchive-zip-perl (1.68-1) ...
Setting up libhtml-tagset-perl (3.20-4) ...
Setting up libdebhelper-perl (13.5.2) ...
Setting up libsqlite3-0:amd64 (3.36.0-2) ...
Setting up liblwp-mediatypes-perl (6.04-1) ...
Setting up libtry-tiny-perl (0.30-1) ...
Setting up libmagic1:amd64 (1:5.39-3) ...
Setting up perl-openssl-defaults:amd64 (5) ...
Setting up gettext-base (0.21-4) ...
Setting up libencode-locale-perl (1.05-1.1) ...
Setting up libnpth0:amd64 (1.6-3) ...
Setting up file (1:5.39-3) ...
Setting up libassuan0:amd64 (2.5.5-1) ...
Setting up gem2deb-test-runner (1.4) ...
Setting up libsasl2-modules-db:amd64 (2.1.27+dfsg-2.1) ...
Setting up autotools-dev (20180224.1+nmu1) ...
Setting up gnupg-l10n (2.2.27-2) ...
Setting up libsigsegv2:amd64 (2.13-1) ...
Setting up libio-html-perl (1.004-2) ...
Setting up autopoint (0.21-4) ...
Setting up libb-hooks-op-check-perl (0.22-1+b3) ...
Setting up libipc-run-perl (20200505.0-1) ...
Setting up libncursesw6:amd64 (6.2+20210905-1) ...
Setting up libsasl2-2:amd64 (2.1.27+dfsg-2.1) ...
Setting up libtimedate-perl (2.3300-2) ...
Setting up sensible-utils (0.0.17) ...
Setting up libuchardet0:amd64 (0.0.7-1) ...
Setting up libmpdec3:amd64 (2.5.1-2) ...
Setting up librole-tiny-perl (2.002004-1) ...
Setting up libsub-override-perl (0.09-2) ...
Setting up netbase (6.3) ...
Setting up libsub-quote-perl (2.006006-1) ...
Setting up libfile-dirlist-perl (0.05-2) ...
Setting up libfile-homedir-perl (1.006-1) ...
Setting up libelf1:amd64 (0.185-2) ...
Setting up readline-common (8.1-2) ...
Setting up libxml2:amd64 (2.9.12+dfsg-5) ...
Setting up liburi-perl (5.08-1) ...
Setting up libfile-touch-perl (0.12-1) ...
Setting up libnet-ssleay-perl (1.88-3+b1) ...
Setting up pinentry-curses (1.1.0-4) ...
Setting up libfile-stripnondeterminism-perl (1.12.0-1) ...
Setting up libhttp-date-perl (6.05-1) ...
Setting up gettext (0.21-4) ...
Setting up libfile-listing-perl (6.14-1) ...
Setting up libtool (2.4.6-15) ...
Setting up libreadline8:amd64 (8.1-2) ...
Setting up libldap-2.4-2:amd64 (2.4.59+dfsg-1) ...
Setting up libnet-http-perl (6.21-1) ...
Setting up m4 (1.4.18-5) ...
Setting up libdevel-callchecker-perl (0.008-1+b2) ...
Setting up intltool-debian (0.35.0+20060710.5) ...
Setting up patchutils (0.4.2-1) ...
Setting up autoconf (2.71-2) ...
Setting up dh-strip-nondeterminism (1.12.0-1) ...
Setting up libwww-robotrules-perl (6.02-1) ...
Setting up dwz (0.14-1) ...
Setting up groff-base (1.22.4-7) ...
Setting up libhtml-parser-perl:amd64 (3.76-1) ...
Setting up gpgconf (2.2.27-2) ...
Setting up libio-socket-ssl-perl (2.072-1) ...
Setting up gpg (2.2.27-2) ...
Setting up libpython3.9-stdlib:amd64 (3.9.7-4) ...
Setting up libpython3-stdlib:amd64 (3.9.2-3) ...
Setting up gnupg-utils (2.2.27-2) ...
Setting up libhttp-message-perl (6.33-1) ...
Setting up automake (1:1.16.4-2) ...
update-alternatives: using /usr/bin/automake-1.16 to provide /usr/bin/automake (automake) in auto mode
Setting up libhttp-negotiate-perl (6.01-1) ...
Setting up gpg-agent (2.2.27-2) ...
Setting up libhttp-cookies-perl (6.10-1) ...
Setting up po-debconf (1.0.21+nmu1) ...
Setting up libhtml-tree-perl (5.07-2) ...
Setting up libparams-classify-perl (0.015-1+b3) ...
Setting up gpgsm (2.2.27-2) ...
Setting up man-db (2.9.4-2) ...
Not building database; man-db/auto-update is not 'true'.
Setting up dh-autoreconf (20) ...
Setting up dirmngr (2.2.27-2) ...
Setting up libmodule-runtime-perl (0.016-1) ...
Setting up gpg-wks-server (2.2.27-2) ...
Setting up python3.9 (3.9.7-4) ...
Setting up gpg-wks-client (2.2.27-2) ...
Setting up libimport-into-perl (1.002005-1) ...
Setting up libmoo-perl (2.005004-2) ...
Setting up debhelper (13.5.2) ...
Setting up python3 (3.9.2-3) ...
Setting up gnupg (2.2.27-2) ...
Setting up libwww-perl (6.53-1) ...
Setting up devscripts (2.21.4) ...
Setting up gem2deb (1.4) ...
Setting up liblwp-protocol-https-perl (6.10-1) ...
Setting up sbuild-build-depends-main-dummy (0.invalid.0) ...
Processing triggers for libc-bin (2.32-4) ...

+------------------------------------------------------------------------------+
| Check architectures                                                          |
+------------------------------------------------------------------------------+

Arch check ok (amd64 included in any)

+------------------------------------------------------------------------------+
| Build environment                                                            |
+------------------------------------------------------------------------------+

Kernel: Linux 5.10.0-1-amd64 #1 SMP Debian 5.10.5-1 (2021-01-09) amd64 (x86_64)
Toolchain package versions: binutils_2.37-7 dpkg-dev_1.20.9 g++-10_10.3.0-11 gcc-10_10.3.0-11 libc6-dev_2.32-4 libstdc++-10-dev_10.3.0-11 libstdc++6_11.2.0-8 linux-libc-dev_5.14.9-2
Package versions: adduser_3.118 apt_2.3.9 auto-apt-proxy_13.4 autoconf_2.71-2 automake_1:1.16.4-2 autopoint_0.21-4 autotools-dev_20180224.1+nmu1 base-files_12 base-passwd_3.5.52 bash_5.1-3+b2 binutils_2.37-7 binutils-common_2.37-7 binutils-x86-64-linux-gnu_2.37-7 bsdextrautils_2.37.2-3 bsdutils_1:2.37.2-3 build-essential_12.9 bzip2_1.0.8-4 ca-certificates_20210119 coreutils_8.32-4+b1 cpp_4:10.2.1-1 cpp-10_10.3.0-11 dash_0.5.11+git20210120+802ebd4-1 debconf_1.5.77 debhelper_13.5.2 debian-archive-keyring_2021.1.1 debianutils_5.5-1 devscripts_2.21.4 dh-autoreconf_20 dh-strip-nondeterminism_1.12.0-1 diffutils_1:3.7-5 dirmngr_2.2.27-2 dpkg_1.20.9 dpkg-dev_1.20.9 dwz_0.14-1 e2fsprogs_1.46.4-1 fakeroot_1.26-1 file_1:5.39-3 findutils_4.8.0-1 g++_4:10.2.1-1 g++-10_10.3.0-11 gcc_4:10.2.1-1 gcc-10_10.3.0-11 gcc-10-base_10.3.0-11 gcc-11-base_11.2.0-8 gcc-9-base_9.4.0-3 gem2deb_1.4 gem2deb-test-runner_1.4 gettext_0.21-4 gettext-base_0.21-4 gnupg_2.2.27-2 gnupg-l10n_2.2.27-2 gnupg-utils_2.2.27-2 gpg_2.2.27-2 gpg-agent_2.2.27-2 gpg-wks-client_2.2.27-2 gpg-wks-server_2.2.27-2 gpgconf_2.2.27-2 gpgsm_2.2.27-2 gpgv_2.2.27-2 grep_3.7-1 groff-base_1.22.4-7 gzip_1.10-4 hostname_3.23 init-system-helpers_1.60 intltool-debian_0.35.0+20060710.5 libacl1_2.3.1-1 libapt-pkg6.0_2.3.9 libarchive-zip-perl_1.68-1 libasan6_11.2.0-8 libassuan0_2.5.5-1 libatomic1_11.2.0-8 libattr1_1:2.5.1-1 libaudit-common_1:3.0.5-1 libaudit1_1:3.0.5-1 libb-hooks-op-check-perl_0.22-1+b3 libbinutils_2.37-7 libblkid1_2.37.2-3 libbsd0_0.11.3-1 libbz2-1.0_1.0.8-4 libc-bin_2.32-4 libc-dev-bin_2.32-4 libc6_2.32-4 libc6-dev_2.32-4 libcap-ng0_0.7.9-2.2+b1 libcap2_1:2.44-1 libcc1-0_11.2.0-8 libclass-method-modifiers-perl_2.13-1 libcom-err2_1.46.4-1 libcrypt-dev_1:4.4.25-2 libcrypt1_1:4.4.25-2 libctf-nobfd0_2.37-7 libctf0_2.37-7 libdb5.3_5.3.28+dfsg1-0.8 libdebconfclient0_0.260 libdebhelper-perl_13.5.2 libdevel-callchecker-perl_0.008-1+b2 libdpkg-perl_1.20.9 libdynaloader-functions-perl_0.003-1.1 libedit2_3.1-20210910-1 libelf1_0.185-2 libencode-locale-perl_1.05-1.1 libexpat1_2.4.1-2+b1 libext2fs2_1.46.4-1 libfakeroot_1.26-1 libffi7_3.3-6 libffi8_3.4.2-2 libfile-dirlist-perl_0.05-2 libfile-homedir-perl_1.006-1 libfile-listing-perl_6.14-1 libfile-stripnondeterminism-perl_1.12.0-1 libfile-touch-perl_0.12-1 libfile-which-perl_1.23-1 libgcc-10-dev_10.3.0-11 libgcc-s1_11.2.0-8 libgcrypt20_1.9.4-3+b1 libgdbm-compat4_1.21-1 libgdbm6_1.21-1 libgmp-dev_2:6.2.1+dfsg-2 libgmp10_2:6.2.1+dfsg-2 libgmpxx4ldbl_2:6.2.1+dfsg-2 libgnutls30_3.7.2-2 libgomp1_11.2.0-8 libgpg-error0_1.42-3 libgssapi-krb5-2_1.18.3-7 libhogweed6_3.7.3-1 libhtml-parser-perl_3.76-1 libhtml-tagset-perl_3.20-4 libhtml-tree-perl_5.07-2 libhttp-cookies-perl_6.10-1 libhttp-date-perl_6.05-1 libhttp-message-perl_6.33-1 libhttp-negotiate-perl_6.01-1 libicu67_67.1-7 libidn2-0_2.3.2-2 libimport-into-perl_1.002005-1 libio-html-perl_1.004-2 libio-pty-perl_1:1.15-2 libio-socket-ssl-perl_2.072-1 libipc-run-perl_20200505.0-1 libisl23_0.23-1 libitm1_11.2.0-8 libk5crypto3_1.18.3-7 libkeyutils1_1.6.1-2 libkrb5-3_1.18.3-7 libkrb5support0_1.18.3-7 libksba8_1.6.0-2 libldap-2.4-2_2.4.59+dfsg-1 liblsan0_11.2.0-8 liblwp-mediatypes-perl_6.04-1 liblwp-protocol-https-perl_6.10-1 liblz4-1_1.9.3-2 liblzma5_5.2.5-2 libmagic-mgc_1:5.39-3 libmagic1_1:5.39-3 libmd0_1.0.3-3 libmodule-runtime-perl_0.016-1 libmoo-perl_2.005004-2 libmount1_2.37.2-3 libmpc3_1.2.0-1 libmpdec3_2.5.1-2 libmpfr6_4.1.0-3 libncursesw6_6.2+20210905-1 libnet-http-perl_6.21-1 libnet-ssleay-perl_1.88-3+b1 libnettle8_3.7.3-1 libnpth0_1.6-3 libnsl-dev_1.3.0-2 libnsl2_1.3.0-2 libp11-kit0_0.24.0-3 libpam-modules_1.4.0-10 libpam-modules-bin_1.4.0-10 libpam-runtime_1.4.0-10 libpam0g_1.4.0-10 libparams-classify-perl_0.015-1+b3 libpcre2-8-0_10.36-2 libpcre3_2:8.39-13 libperl5.32_5.32.1-6 libpipeline1_1.5.3-1 libpython3-stdlib_3.9.2-3 libpython3.9-minimal_3.9.7-4 libpython3.9-stdlib_3.9.7-4 libquadmath0_11.2.0-8 libreadline8_8.1-2 librole-tiny-perl_2.002004-1 libruby2.7_2.7.4-1+b1 libruby3.0_3.0.2-2 libsasl2-2_2.1.27+dfsg-2.1 libsasl2-modules-db_2.1.27+dfsg-2.1 libseccomp2_2.5.2-2 libselinux1_3.2-1+rebuild1633357389 libsemanage-common_3.1-1+rebuild1610550752 libsemanage1_3.1-1+rebuild1610550752 libsepol1_3.1-1 libsigsegv2_2.13-1 libsmartcols1_2.37.2-3 libsqlite3-0_3.36.0-2 libss2_1.46.4-1 libssl1.1_1.1.1l-1 libssl3_3.0.0~~alpha4-1 libstdc++-10-dev_10.3.0-11 libstdc++6_11.2.0-8 libsub-override-perl_0.09-2 libsub-quote-perl_2.006006-1 libsystemd0_247.9-4 libtasn1-6_4.17.0-2 libtimedate-perl_2.3300-2 libtinfo6_6.2+20210905-1 libtirpc-common_1.3.2-2 libtirpc-dev_1.3.2-2 libtirpc3_1.3.2-2 libtool_2.4.6-15 libtry-tiny-perl_0.30-1 libtsan0_11.2.0-8 libubsan1_11.2.0-8 libuchardet0_0.0.7-1 libudev1_247.9-4 libunistring2_0.9.10-6 liburi-perl_5.08-1 libuuid1_2.37.2-3 libwww-perl_6.53-1 libwww-robotrules-perl_6.02-1 libxml2_2.9.12+dfsg-5 libxxhash0_0.8.0-2 libyaml-0-2_0.2.2-1 libzstd1_1.4.8+dfsg-2.1 linux-libc-dev_5.14.9-2 login_1:4.8.1-1 logsave_1.46.4-1 lsb-base_11.1.0 m4_1.4.18-5 make_4.3-4.1 man-db_2.9.4-2 mawk_1.3.4.20200120-2 media-types_4.0.0 mount_2.37.2-3 ncurses-base_6.2+20210905-1 ncurses-bin_6.2+20210905-1 netbase_6.3 openssl_3.0.0~~alpha4-1 passwd_1:4.8.1-1 patch_2.7.6-7 patchutils_0.4.2-1 perl_5.32.1-6 perl-base_5.32.1-6 perl-modules-5.32_5.32.1-6 perl-openssl-defaults_5 pinentry-curses_1.1.0-4 po-debconf_1.0.21+nmu1 python3_3.9.2-3 python3-minimal_3.9.2-3 python3.9_3.9.7-4 python3.9-minimal_3.9.7-4 rake_13.0.3-1 readline-common_8.1-2 rpcsvc-proto_1.4.2-4 ruby_1:2.7.5 ruby-all-dev_1:2.7.6~exp1 ruby-minitest_5.13.0-1+rebuild1610560505 ruby-net-telnet_0.1.1-2+rebuild1610562728 ruby-power-assert_1.1.7-2 ruby-rubygems_3.2.27-1 ruby-test-unit_3.3.9-1 ruby-xmlrpc_0.3.0-2 ruby2.7_2.7.4-1+b1 ruby2.7-dev_2.7.4-1+b1 ruby3.0_3.0.2-2 ruby3.0-dev_3.0.2-2 rubygems-integration_1.18 sbuild-build-depends-main-dummy_0.invalid.0 sed_4.8-1 sensible-utils_0.0.17 sysvinit-utils_3.00-1 tar_1.34+dfsg-1 tzdata_2021c-1 util-linux_2.37.2-3 wdiff_1.2.2-2+b1 xz-utils_5.2.5-2 zlib1g_1:1.2.11.dfsg-2

+------------------------------------------------------------------------------+
| Build                                                                        |
+------------------------------------------------------------------------------+


Unpack source
-------------

Format: 3.0 (quilt)
Source: ruby-shadow
Binary: ruby-shadow
Architecture: any
Version: 2.5.0-1+rebuild1633395333
Maintainer: Debian Ruby Extras Maintainers <pkg-ruby-extras-maintainers@lists.alioth.debian.org>
Uploaders: akira yamada <akira@debian.org>, Taku YASUI <tach@debian.org>
Homepage: https://github.com/apalmblad/ruby-shadow
Standards-Version: 4.1.3
Vcs-Browser: https://anonscm.debian.org/cgit/pkg-ruby-extras/ruby-shadow.git
Vcs-Git: https://anonscm.debian.org/git/pkg-ruby-extras/ruby-shadow.git
Testsuite: autopkgtest-pkg-ruby
Build-Depends: debhelper (>= 10), gem2deb
Package-List:
 ruby-shadow deb ruby optional arch=any
Checksums-Sha1:
 5254d7eeb57f8a5e5882360d918c20e8e34aac83 7319 ruby-shadow_2.5.0.orig.tar.gz
 82e2c082ae2a92073cdbd55aa59e1b86b7356748 4588 ruby-shadow_2.5.0-1+rebuild1633395333.debian.tar.xz
Checksums-Sha256:
 5b15aed3ad1226ce93e1dc11705972822de5ced79c7b16cf22c5f19fec1401f8 7319 ruby-shadow_2.5.0.orig.tar.gz
 e0ef53f58211388f1d8d8e5f14820c9be7452f17eda67062b3da980a58faaac1 4588 ruby-shadow_2.5.0-1+rebuild1633395333.debian.tar.xz
Files:
 09d6ba3e726cb17a33f24fb9631f9e1c 7319 ruby-shadow_2.5.0.orig.tar.gz
 69041c3108f626064574844374db94f3 4588 ruby-shadow_2.5.0-1+rebuild1633395333.debian.tar.xz
Ruby-Versions: all

dpkg-source: warning: extracting unsigned source package (ruby-shadow_2.5.0-1+rebuild1633395333.dsc)
dpkg-source: info: extracting ruby-shadow in /<<PKGBUILDDIR>>
dpkg-source: info: unpacking ruby-shadow_2.5.0.orig.tar.gz
dpkg-source: info: unpacking ruby-shadow_2.5.0-1+rebuild1633395333.debian.tar.xz
dpkg-source: info: using patch list from debian/patches/series
dpkg-source: info: applying 010_fix_license
dpkg-source: info: applying dont-overwrite-compiler-flags
dpkg-source: info: applying use-shadow-implementation-on-gnu-archs

Check disk space
----------------

Sufficient free space for build

User Environment
----------------

APT_CONFIG=/var/lib/sbuild/apt.conf
HOME=/sbuild-nonexistent
LANG=C.UTF-8
LC_ALL=C.UTF-8
LOGNAME=admin
PATH=/usr/local/sbin:/usr/local/bin:/usr/sbin:/usr/bin:/sbin:/bin:/usr/games
SCHROOT_ALIAS_NAME=experimental-amd64-mass-rebuild
SCHROOT_CHROOT_NAME=experimental-amd64-mass-rebuild
SCHROOT_COMMAND=env
SCHROOT_GID=1000
SCHROOT_GROUP=admin
SCHROOT_SESSION_ID=experimental-amd64-mass-rebuild-a29d31a7-6724-4e8e-8a50-a473a2d05427
SCHROOT_UID=1000
SCHROOT_USER=admin
SHELL=/bin/sh
USER=admin

dpkg-buildpackage
-----------------

Command: dpkg-buildpackage --sanitize-env -us -uc -mAutomated rebuild <nobody@debian.org> -b -rfakeroot
dpkg-buildpackage: info: source package ruby-shadow
dpkg-buildpackage: info: source version 2.5.0-1+rebuild1633395333
dpkg-buildpackage: info: source distribution UNRELEASED
 dpkg-source --before-build .
dpkg-buildpackage: info: host architecture amd64
 fakeroot debian/rules clean
dh clean --buildsystem=ruby --with ruby
   dh_auto_clean -O--buildsystem=ruby
	dh_ruby --clean
   dh_ruby --clean
   dh_autoreconf_clean -O--buildsystem=ruby
   dh_clean -O--buildsystem=ruby
 debian/rules build
dh build --buildsystem=ruby --with ruby
   dh_update_autotools_config -O--buildsystem=ruby
   dh_autoreconf -O--buildsystem=ruby
   dh_auto_configure -O--buildsystem=ruby
	dh_ruby --configure
   dh_auto_build -O--buildsystem=ruby
	dh_ruby --build
   dh_ruby --build
   dh_auto_test -O--buildsystem=ruby
	dh_ruby --test
   create-stamp debian/debhelper-build-stamp
 fakeroot debian/rules binary
dh binary --buildsystem=ruby --with ruby
   dh_testroot -O--buildsystem=ruby
   dh_prep -O--buildsystem=ruby
   dh_auto_install --destdir=debian/ruby-shadow/ -O--buildsystem=ruby
	dh_ruby --install /<<PKGBUILDDIR>>/debian/ruby-shadow
   dh_ruby --install

┌──────────────────────────────────────────────────────────────────────────────┐
│ Install files                                                                │
└──────────────────────────────────────────────────────────────────────────────┘


┌──────────────────────────────────────────────────────────────────────────────┐
│ Build native extensions for ruby2.7                                          │
└──────────────────────────────────────────────────────────────────────────────┘

/usr/bin/ruby2.7 /usr/lib/ruby/vendor_ruby/gem2deb/extension_builder.rb /<<PKGBUILDDIR>> debian/ruby-shadow
current directory: /<<PKGBUILDDIR>>
["/usr/bin/ruby2.7", "-I", "/usr/lib/ruby/vendor_ruby", "-r", "./siteconf20211005-1447521-n40nrd.rb", "extconf.rb"]
checking for getspent() in -lshadow... no
checking for getspent()... yes
checking for fgetspent()... yes
checking for setspent()... yes
checking for endspent()... yes
checking for lckpwdf()... yes
checking for ulckpwdf()... yes
checking for sgetspent()... yes
checking for ruby/io.h... yes
creating Makefile
current directory: /<<PKGBUILDDIR>>
["make", "V=1", "CC=gcc -fdebug-prefix-map=/<<PKGBUILDDIR>>=.", "CXX=g++ -fdebug-prefix-map=/<<PKGBUILDDIR>>=.", "DESTDIR=", "clean"]
make[1]: Entering directory '/<<PKGBUILDDIR>>'
rm -f 
rm -f shadow.so  *.o  *.bak mkmf.log .*.time
make[1]: Leaving directory '/<<PKGBUILDDIR>>'
current directory: /<<PKGBUILDDIR>>
["make", "V=1", "CC=gcc -fdebug-prefix-map=/<<PKGBUILDDIR>>=.", "CXX=g++ -fdebug-prefix-map=/<<PKGBUILDDIR>>=.", "DESTDIR="]
make[1]: Entering directory '/<<PKGBUILDDIR>>'
gcc -fdebug-prefix-map=/<<PKGBUILDDIR>>=. -I. -I/usr/include/x86_64-linux-gnu/ruby-2.7.0 -I/usr/include/ruby-2.7.0/ruby/backward -I/usr/include/ruby-2.7.0 -Ishadow -DHAVE_GETSPENT -DHAVE_FGETSPENT -DHAVE_SETSPENT -DHAVE_ENDSPENT -DHAVE_LCKPWDF -DHAVE_ULCKPWDF -DHAVE_SGETSPENT -DHAVE_RUBY_IO_H -Wdate-time -D_FORTIFY_SOURCE=2   -fPIC -g -O2 -ffile-prefix-map=/build/ruby2.7-yGW2TI/ruby2.7-2.7.4=. -fstack-protector-strong -Wformat -Werror=format-security -fPIC -DRUBY19  -o shadow.o -c shadow/shadow.c
rm -f shadow.so
gcc -fdebug-prefix-map=/<<PKGBUILDDIR>>=. -shared -o shadow.so shadow.o -L. -L/usr/lib/x86_64-linux-gnu -L. -Wl,-z,relro -Wl,-z,now -fstack-protector-strong -rdynamic -Wl,-export-dynamic -Wl,-z,relro -Wl,-z,now    -lruby-2.7  -lm   -lc
make[1]: Leaving directory '/<<PKGBUILDDIR>>'
current directory: /<<PKGBUILDDIR>>
["make", "V=1", "CC=gcc -fdebug-prefix-map=/<<PKGBUILDDIR>>=.", "CXX=g++ -fdebug-prefix-map=/<<PKGBUILDDIR>>=.", "DESTDIR=", "install"]
make[1]: Entering directory '/<<PKGBUILDDIR>>'
/bin/mkdir -p . ./.gem.20211005-1447521-1mwrw3n
exit > .sitearchdir.time
/usr/bin/install -c -m 0755 shadow.so ./.gem.20211005-1447521-1mwrw3n
make[1]: Leaving directory '/<<PKGBUILDDIR>>'
current directory: /<<PKGBUILDDIR>>
/usr/bin/ruby2.7 -I /usr/lib/ruby/vendor_ruby -r ./siteconf20211005-1447521-n40nrd.rb extconf.rb
current directory: /<<PKGBUILDDIR>>
make V\=1 CC\=gcc\ -fdebug-prefix-map\=/<<PKGBUILDDIR>>\=. CXX\=g++\ -fdebug-prefix-map\=/<<PKGBUILDDIR>>\=. DESTDIR\= clean
current directory: /<<PKGBUILDDIR>>
make V\=1 CC\=gcc\ -fdebug-prefix-map\=/<<PKGBUILDDIR>>\=. CXX\=g++\ -fdebug-prefix-map\=/<<PKGBUILDDIR>>\=. DESTDIR\=
current directory: /<<PKGBUILDDIR>>
make V\=1 CC\=gcc\ -fdebug-prefix-map\=/<<PKGBUILDDIR>>\=. CXX\=g++\ -fdebug-prefix-map\=/<<PKGBUILDDIR>>\=. DESTDIR\= install
rm -f /<<PKGBUILDDIR>>/debian/ruby-shadow/usr/lib/x86_64-linux-gnu/ruby/vendor_ruby/2.7.0/mkmf.log

┌──────────────────────────────────────────────────────────────────────────────┐
│ Build native extensions for ruby3.0                                          │
└──────────────────────────────────────────────────────────────────────────────┘

/usr/bin/ruby3.0 /usr/lib/ruby/vendor_ruby/gem2deb/extension_builder.rb /<<PKGBUILDDIR>> debian/ruby-shadow
"make clean"
make[1]: Entering directory '/<<PKGBUILDDIR>>'
make[1]: Leaving directory '/<<PKGBUILDDIR>>'
"make clean"
make[1]: Entering directory '/<<PKGBUILDDIR>>'
make[1]: Leaving directory '/<<PKGBUILDDIR>>'
current directory: /<<PKGBUILDDIR>>
["/usr/bin/ruby3.0", "-I", "/usr/lib/ruby/vendor_ruby", "-r", "./siteconf20211005-1447748-1oje7s.rb", "extconf.rb"]
checking for getspent() in -lshadow... no
checking for getspent()... yes
checking for fgetspent()... yes
checking for setspent()... yes
checking for endspent()... yes
checking for lckpwdf()... yes
checking for ulckpwdf()... yes
checking for sgetspent()... yes
checking for ruby/io.h... yes
creating Makefile
current directory: /<<PKGBUILDDIR>>
["make", "V=1", "CC=gcc -fdebug-prefix-map=/<<PKGBUILDDIR>>=.", "CXX=g++ -fdebug-prefix-map=/<<PKGBUILDDIR>>=.", "DESTDIR=", "clean"]
make[1]: Entering directory '/<<PKGBUILDDIR>>'
rm -f 
rm -f shadow.so  *.o  *.bak mkmf.log .*.time
make[1]: Leaving directory '/<<PKGBUILDDIR>>'
current directory: /<<PKGBUILDDIR>>
["make", "V=1", "CC=gcc -fdebug-prefix-map=/<<PKGBUILDDIR>>=.", "CXX=g++ -fdebug-prefix-map=/<<PKGBUILDDIR>>=.", "DESTDIR="]
make[1]: Entering directory '/<<PKGBUILDDIR>>'
gcc -fdebug-prefix-map=/<<PKGBUILDDIR>>=. -I. -I/usr/include/x86_64-linux-gnu/ruby-3.0.0 -I/usr/include/ruby-3.0.0/ruby/backward -I/usr/include/ruby-3.0.0 -Ishadow -DHAVE_GETSPENT -DHAVE_FGETSPENT -DHAVE_SETSPENT -DHAVE_ENDSPENT -DHAVE_LCKPWDF -DHAVE_ULCKPWDF -DHAVE_SGETSPENT -DHAVE_RUBY_IO_H -Wdate-time -D_FORTIFY_SOURCE=2   -fPIC -g -O2 -ffile-prefix-map=/build/ruby3.0-2KsnwC/ruby3.0-3.0.2=. -fstack-protector-strong -Wformat -Werror=format-security -fPIC  -o shadow.o -c shadow/shadow.c
shadow/shadow.c: In function ‘rb_shadow_fgetspent’:
shadow/shadow.c:21:26: error: ‘struct rb_io_t’ has no member named ‘f’; did you mean ‘fd’?
   21 | #define file_ptr(x) (x)->f
      |                          ^
shadow/shadow.c:95:22: note: in expansion of macro ‘file_ptr’
   95 |   entry = fgetspent( file_ptr( (RFILE(file)->fptr) ) );
      |                      ^~~~~~~~
shadow/shadow.c: In function ‘rb_shadow_putspent’:
shadow/shadow.c:21:26: error: ‘struct rb_io_t’ has no member named ‘f’; did you mean ‘fd’?
   21 | #define file_ptr(x) (x)->f
      |                          ^
shadow/shadow.c:154:11: note: in expansion of macro ‘file_ptr’
  154 |   cfile = file_ptr( RFILE(file)->fptr );
      |           ^~~~~~~~
make[1]: *** [Makefile:245: shadow.o] Error 1
make[1]: Leaving directory '/<<PKGBUILDDIR>>'
~~~~~~~~~~~~~~~~~~~~~ ↓ mkmf.log ~~~~~~~~~~~~~~~~~~~~~
have_library: checking for getspent() in -lshadow... -------------------- no

"x86_64-linux-gnu-gcc -o conftest -I/usr/include/x86_64-linux-gnu/ruby-3.0.0 -I/usr/include/ruby-3.0.0/ruby/backward -I/usr/include/ruby-3.0.0 -I. -Wdate-time -D_FORTIFY_SOURCE=2   -g -O2 -ffile-prefix-map=/build/ruby3.0-2KsnwC/ruby3.0-3.0.2=. -fstack-protector-strong -Wformat -Werror=format-security -fPIC conftest.c  -L. -L/usr/lib/x86_64-linux-gnu -L. -Wl,-z,relro -Wl,-z,now -fstack-protector-strong -rdynamic -Wl,-export-dynamic     -lruby-3.0  -lm   -lc"
checked program was:
/* begin */
1: #include "ruby.h"
2: 
3: int main(int argc, char **argv)
4: {
5:   return !!argv[argc];
6: }
/* end */

"x86_64-linux-gnu-gcc -o conftest -I/usr/include/x86_64-linux-gnu/ruby-3.0.0 -I/usr/include/ruby-3.0.0/ruby/backward -I/usr/include/ruby-3.0.0 -I. -Wdate-time -D_FORTIFY_SOURCE=2   -g -O2 -ffile-prefix-map=/build/ruby3.0-2KsnwC/ruby3.0-3.0.2=. -fstack-protector-strong -Wformat -Werror=format-security -fPIC conftest.c  -L. -L/usr/lib/x86_64-linux-gnu -L. -Wl,-z,relro -Wl,-z,now -fstack-protector-strong -rdynamic -Wl,-export-dynamic     -lruby-3.0 -lshadow  -lm   -lc"
conftest.c: In function ‘t’:
conftest.c:14:57: error: ‘getspent’ undeclared (first use in this function); did you mean ‘getopt’?
   14 | int t(void) { void ((*volatile p)()); p = (void ((*)()))getspent; return !p; }
      |                                                         ^~~~~~~~
      |                                                         getopt
conftest.c:14:57: note: each undeclared identifier is reported only once for each function it appears in
checked program was:
/* begin */
 1: #include "ruby.h"
 2: 
 3: /*top*/
 4: extern int t(void);
 5: int main(int argc, char **argv)
 6: {
 7:   if (argc > 1000000) {
 8:     int (* volatile tp)(void)=(int (*)(void))&t;
 9:     printf("%d", (*tp)());
10:   }
11: 
12:   return !!argv[argc];
13: }
14: int t(void) { void ((*volatile p)()); p = (void ((*)()))getspent; return !p; }
/* end */

"x86_64-linux-gnu-gcc -o conftest -I/usr/include/x86_64-linux-gnu/ruby-3.0.0 -I/usr/include/ruby-3.0.0/ruby/backward -I/usr/include/ruby-3.0.0 -I. -Wdate-time -D_FORTIFY_SOURCE=2   -g -O2 -ffile-prefix-map=/build/ruby3.0-2KsnwC/ruby3.0-3.0.2=. -fstack-protector-strong -Wformat -Werror=format-security -fPIC conftest.c  -L. -L/usr/lib/x86_64-linux-gnu -L. -Wl,-z,relro -Wl,-z,now -fstack-protector-strong -rdynamic -Wl,-export-dynamic     -lruby-3.0 -lshadow  -lm   -lc"
/usr/bin/ld: cannot find -lshadow
collect2: error: ld returned 1 exit status
checked program was:
/* begin */
 1: #include "ruby.h"
 2: 
 3: /*top*/
 4: extern int t(void);
 5: int main(int argc, char **argv)
 6: {
 7:   if (argc > 1000000) {
 8:     int (* volatile tp)(void)=(int (*)(void))&t;
 9:     printf("%d", (*tp)());
10:   }
11: 
12:   return !!argv[argc];
13: }
14: extern void getspent();
15: int t(void) { getspent(); return 0; }
/* end */

--------------------

have_func: checking for getspent()... -------------------- yes

"x86_64-linux-gnu-gcc -o conftest -I/usr/include/x86_64-linux-gnu/ruby-3.0.0 -I/usr/include/ruby-3.0.0/ruby/backward -I/usr/include/ruby-3.0.0 -I. -Wdate-time -D_FORTIFY_SOURCE=2   -g -O2 -ffile-prefix-map=/build/ruby3.0-2KsnwC/ruby3.0-3.0.2=. -fstack-protector-strong -Wformat -Werror=format-security -fPIC conftest.c  -L. -L/usr/lib/x86_64-linux-gnu -L. -Wl,-z,relro -Wl,-z,now -fstack-protector-strong -rdynamic -Wl,-export-dynamic     -lruby-3.0  -lm   -lc"
conftest.c: In function ‘t’:
conftest.c:14:57: error: ‘getspent’ undeclared (first use in this function); did you mean ‘getopt’?
   14 | int t(void) { void ((*volatile p)()); p = (void ((*)()))getspent; return !p; }
      |                                                         ^~~~~~~~
      |                                                         getopt
conftest.c:14:57: note: each undeclared identifier is reported only once for each function it appears in
checked program was:
/* begin */
 1: #include "ruby.h"
 2: 
 3: /*top*/
 4: extern int t(void);
 5: int main(int argc, char **argv)
 6: {
 7:   if (argc > 1000000) {
 8:     int (* volatile tp)(void)=(int (*)(void))&t;
 9:     printf("%d", (*tp)());
10:   }
11: 
12:   return !!argv[argc];
13: }
14: int t(void) { void ((*volatile p)()); p = (void ((*)()))getspent; return !p; }
/* end */

"x86_64-linux-gnu-gcc -o conftest -I/usr/include/x86_64-linux-gnu/ruby-3.0.0 -I/usr/include/ruby-3.0.0/ruby/backward -I/usr/include/ruby-3.0.0 -I. -Wdate-time -D_FORTIFY_SOURCE=2   -g -O2 -ffile-prefix-map=/build/ruby3.0-2KsnwC/ruby3.0-3.0.2=. -fstack-protector-strong -Wformat -Werror=format-security -fPIC conftest.c  -L. -L/usr/lib/x86_64-linux-gnu -L. -Wl,-z,relro -Wl,-z,now -fstack-protector-strong -rdynamic -Wl,-export-dynamic     -lruby-3.0  -lm   -lc"
checked program was:
/* begin */
 1: #include "ruby.h"
 2: 
 3: /*top*/
 4: extern int t(void);
 5: int main(int argc, char **argv)
 6: {
 7:   if (argc > 1000000) {
 8:     int (* volatile tp)(void)=(int (*)(void))&t;
 9:     printf("%d", (*tp)());
10:   }
11: 
12:   return !!argv[argc];
13: }
14: extern void getspent();
15: int t(void) { getspent(); return 0; }
/* end */

--------------------

have_func: checking for fgetspent()... -------------------- yes

"x86_64-linux-gnu-gcc -o conftest -I/usr/include/x86_64-linux-gnu/ruby-3.0.0 -I/usr/include/ruby-3.0.0/ruby/backward -I/usr/include/ruby-3.0.0 -I. -Wdate-time -D_FORTIFY_SOURCE=2   -g -O2 -ffile-prefix-map=/build/ruby3.0-2KsnwC/ruby3.0-3.0.2=. -fstack-protector-strong -Wformat -Werror=format-security -fPIC conftest.c  -L. -L/usr/lib/x86_64-linux-gnu -L. -Wl,-z,relro -Wl,-z,now -fstack-protector-strong -rdynamic -Wl,-export-dynamic     -lruby-3.0  -lm   -lc"
conftest.c: In function ‘t’:
conftest.c:14:57: error: ‘fgetspent’ undeclared (first use in this function)
   14 | int t(void) { void ((*volatile p)()); p = (void ((*)()))fgetspent; return !p; }
      |                                                         ^~~~~~~~~
conftest.c:14:57: note: each undeclared identifier is reported only once for each function it appears in
checked program was:
/* begin */
 1: #include "ruby.h"
 2: 
 3: /*top*/
 4: extern int t(void);
 5: int main(int argc, char **argv)
 6: {
 7:   if (argc > 1000000) {
 8:     int (* volatile tp)(void)=(int (*)(void))&t;
 9:     printf("%d", (*tp)());
10:   }
11: 
12:   return !!argv[argc];
13: }
14: int t(void) { void ((*volatile p)()); p = (void ((*)()))fgetspent; return !p; }
/* end */

"x86_64-linux-gnu-gcc -o conftest -I/usr/include/x86_64-linux-gnu/ruby-3.0.0 -I/usr/include/ruby-3.0.0/ruby/backward -I/usr/include/ruby-3.0.0 -I. -Wdate-time -D_FORTIFY_SOURCE=2   -g -O2 -ffile-prefix-map=/build/ruby3.0-2KsnwC/ruby3.0-3.0.2=. -fstack-protector-strong -Wformat -Werror=format-security -fPIC conftest.c  -L. -L/usr/lib/x86_64-linux-gnu -L. -Wl,-z,relro -Wl,-z,now -fstack-protector-strong -rdynamic -Wl,-export-dynamic     -lruby-3.0  -lm   -lc"
checked program was:
/* begin */
 1: #include "ruby.h"
 2: 
 3: /*top*/
 4: extern int t(void);
 5: int main(int argc, char **argv)
 6: {
 7:   if (argc > 1000000) {
 8:     int (* volatile tp)(void)=(int (*)(void))&t;
 9:     printf("%d", (*tp)());
10:   }
11: 
12:   return !!argv[argc];
13: }
14: extern void fgetspent();
15: int t(void) { fgetspent(); return 0; }
/* end */

--------------------

have_func: checking for setspent()... -------------------- yes

"x86_64-linux-gnu-gcc -o conftest -I/usr/include/x86_64-linux-gnu/ruby-3.0.0 -I/usr/include/ruby-3.0.0/ruby/backward -I/usr/include/ruby-3.0.0 -I. -Wdate-time -D_FORTIFY_SOURCE=2   -g -O2 -ffile-prefix-map=/build/ruby3.0-2KsnwC/ruby3.0-3.0.2=. -fstack-protector-strong -Wformat -Werror=format-security -fPIC conftest.c  -L. -L/usr/lib/x86_64-linux-gnu -L. -Wl,-z,relro -Wl,-z,now -fstack-protector-strong -rdynamic -Wl,-export-dynamic     -lruby-3.0  -lm   -lc"
conftest.c: In function ‘t’:
conftest.c:14:57: error: ‘setspent’ undeclared (first use in this function); did you mean ‘setenv’?
   14 | int t(void) { void ((*volatile p)()); p = (void ((*)()))setspent; return !p; }
      |                                                         ^~~~~~~~
      |                                                         setenv
conftest.c:14:57: note: each undeclared identifier is reported only once for each function it appears in
checked program was:
/* begin */
 1: #include "ruby.h"
 2: 
 3: /*top*/
 4: extern int t(void);
 5: int main(int argc, char **argv)
 6: {
 7:   if (argc > 1000000) {
 8:     int (* volatile tp)(void)=(int (*)(void))&t;
 9:     printf("%d", (*tp)());
10:   }
11: 
12:   return !!argv[argc];
13: }
14: int t(void) { void ((*volatile p)()); p = (void ((*)()))setspent; return !p; }
/* end */

"x86_64-linux-gnu-gcc -o conftest -I/usr/include/x86_64-linux-gnu/ruby-3.0.0 -I/usr/include/ruby-3.0.0/ruby/backward -I/usr/include/ruby-3.0.0 -I. -Wdate-time -D_FORTIFY_SOURCE=2   -g -O2 -ffile-prefix-map=/build/ruby3.0-2KsnwC/ruby3.0-3.0.2=. -fstack-protector-strong -Wformat -Werror=format-security -fPIC conftest.c  -L. -L/usr/lib/x86_64-linux-gnu -L. -Wl,-z,relro -Wl,-z,now -fstack-protector-strong -rdynamic -Wl,-export-dynamic     -lruby-3.0  -lm   -lc"
checked program was:
/* begin */
 1: #include "ruby.h"
 2: 
 3: /*top*/
 4: extern int t(void);
 5: int main(int argc, char **argv)
 6: {
 7:   if (argc > 1000000) {
 8:     int (* volatile tp)(void)=(int (*)(void))&t;
 9:     printf("%d", (*tp)());
10:   }
11: 
12:   return !!argv[argc];
13: }
14: extern void setspent();
15: int t(void) { setspent(); return 0; }
/* end */

--------------------

have_func: checking for endspent()... -------------------- yes

"x86_64-linux-gnu-gcc -o conftest -I/usr/include/x86_64-linux-gnu/ruby-3.0.0 -I/usr/include/ruby-3.0.0/ruby/backward -I/usr/include/ruby-3.0.0 -I. -Wdate-time -D_FORTIFY_SOURCE=2   -g -O2 -ffile-prefix-map=/build/ruby3.0-2KsnwC/ruby3.0-3.0.2=. -fstack-protector-strong -Wformat -Werror=format-security -fPIC conftest.c  -L. -L/usr/lib/x86_64-linux-gnu -L. -Wl,-z,relro -Wl,-z,now -fstack-protector-strong -rdynamic -Wl,-export-dynamic     -lruby-3.0  -lm   -lc"
conftest.c: In function ‘t’:
conftest.c:14:57: error: ‘endspent’ undeclared (first use in this function)
   14 | int t(void) { void ((*volatile p)()); p = (void ((*)()))endspent; return !p; }
      |                                                         ^~~~~~~~
conftest.c:14:57: note: each undeclared identifier is reported only once for each function it appears in
checked program was:
/* begin */
 1: #include "ruby.h"
 2: 
 3: /*top*/
 4: extern int t(void);
 5: int main(int argc, char **argv)
 6: {
 7:   if (argc > 1000000) {
 8:     int (* volatile tp)(void)=(int (*)(void))&t;
 9:     printf("%d", (*tp)());
10:   }
11: 
12:   return !!argv[argc];
13: }
14: int t(void) { void ((*volatile p)()); p = (void ((*)()))endspent; return !p; }
/* end */

"x86_64-linux-gnu-gcc -o conftest -I/usr/include/x86_64-linux-gnu/ruby-3.0.0 -I/usr/include/ruby-3.0.0/ruby/backward -I/usr/include/ruby-3.0.0 -I. -Wdate-time -D_FORTIFY_SOURCE=2   -g -O2 -ffile-prefix-map=/build/ruby3.0-2KsnwC/ruby3.0-3.0.2=. -fstack-protector-strong -Wformat -Werror=format-security -fPIC conftest.c  -L. -L/usr/lib/x86_64-linux-gnu -L. -Wl,-z,relro -Wl,-z,now -fstack-protector-strong -rdynamic -Wl,-export-dynamic     -lruby-3.0  -lm   -lc"
checked program was:
/* begin */
 1: #include "ruby.h"
 2: 
 3: /*top*/
 4: extern int t(void);
 5: int main(int argc, char **argv)
 6: {
 7:   if (argc > 1000000) {
 8:     int (* volatile tp)(void)=(int (*)(void))&t;
 9:     printf("%d", (*tp)());
10:   }
11: 
12:   return !!argv[argc];
13: }
14: extern void endspent();
15: int t(void) { endspent(); return 0; }
/* end */

--------------------

have_func: checking for lckpwdf()... -------------------- yes

"x86_64-linux-gnu-gcc -o conftest -I/usr/include/x86_64-linux-gnu/ruby-3.0.0 -I/usr/include/ruby-3.0.0/ruby/backward -I/usr/include/ruby-3.0.0 -I. -Wdate-time -D_FORTIFY_SOURCE=2   -g -O2 -ffile-prefix-map=/build/ruby3.0-2KsnwC/ruby3.0-3.0.2=. -fstack-protector-strong -Wformat -Werror=format-security -fPIC conftest.c  -L. -L/usr/lib/x86_64-linux-gnu -L. -Wl,-z,relro -Wl,-z,now -fstack-protector-strong -rdynamic -Wl,-export-dynamic     -lruby-3.0  -lm   -lc"
conftest.c: In function ‘t’:
conftest.c:14:57: error: ‘lckpwdf’ undeclared (first use in this function)
   14 | int t(void) { void ((*volatile p)()); p = (void ((*)()))lckpwdf; return !p; }
      |                                                         ^~~~~~~
conftest.c:14:57: note: each undeclared identifier is reported only once for each function it appears in
checked program was:
/* begin */
 1: #include "ruby.h"
 2: 
 3: /*top*/
 4: extern int t(void);
 5: int main(int argc, char **argv)
 6: {
 7:   if (argc > 1000000) {
 8:     int (* volatile tp)(void)=(int (*)(void))&t;
 9:     printf("%d", (*tp)());
10:   }
11: 
12:   return !!argv[argc];
13: }
14: int t(void) { void ((*volatile p)()); p = (void ((*)()))lckpwdf; return !p; }
/* end */

"x86_64-linux-gnu-gcc -o conftest -I/usr/include/x86_64-linux-gnu/ruby-3.0.0 -I/usr/include/ruby-3.0.0/ruby/backward -I/usr/include/ruby-3.0.0 -I. -Wdate-time -D_FORTIFY_SOURCE=2   -g -O2 -ffile-prefix-map=/build/ruby3.0-2KsnwC/ruby3.0-3.0.2=. -fstack-protector-strong -Wformat -Werror=format-security -fPIC conftest.c  -L. -L/usr/lib/x86_64-linux-gnu -L. -Wl,-z,relro -Wl,-z,now -fstack-protector-strong -rdynamic -Wl,-export-dynamic     -lruby-3.0  -lm   -lc"
checked program was:
/* begin */
 1: #include "ruby.h"
 2: 
 3: /*top*/
 4: extern int t(void);
 5: int main(int argc, char **argv)
 6: {
 7:   if (argc > 1000000) {
 8:     int (* volatile tp)(void)=(int (*)(void))&t;
 9:     printf("%d", (*tp)());
10:   }
11: 
12:   return !!argv[argc];
13: }
14: extern void lckpwdf();
15: int t(void) { lckpwdf(); return 0; }
/* end */

--------------------

have_func: checking for ulckpwdf()... -------------------- yes

"x86_64-linux-gnu-gcc -o conftest -I/usr/include/x86_64-linux-gnu/ruby-3.0.0 -I/usr/include/ruby-3.0.0/ruby/backward -I/usr/include/ruby-3.0.0 -I. -Wdate-time -D_FORTIFY_SOURCE=2   -g -O2 -ffile-prefix-map=/build/ruby3.0-2KsnwC/ruby3.0-3.0.2=. -fstack-protector-strong -Wformat -Werror=format-security -fPIC conftest.c  -L. -L/usr/lib/x86_64-linux-gnu -L. -Wl,-z,relro -Wl,-z,now -fstack-protector-strong -rdynamic -Wl,-export-dynamic     -lruby-3.0  -lm   -lc"
conftest.c: In function ‘t’:
conftest.c:14:57: error: ‘ulckpwdf’ undeclared (first use in this function)
   14 | int t(void) { void ((*volatile p)()); p = (void ((*)()))ulckpwdf; return !p; }
      |                                                         ^~~~~~~~
conftest.c:14:57: note: each undeclared identifier is reported only once for each function it appears in
checked program was:
/* begin */
 1: #include "ruby.h"
 2: 
 3: /*top*/
 4: extern int t(void);
 5: int main(int argc, char **argv)
 6: {
 7:   if (argc > 1000000) {
 8:     int (* volatile tp)(void)=(int (*)(void))&t;
 9:     printf("%d", (*tp)());
10:   }
11: 
12:   return !!argv[argc];
13: }
14: int t(void) { void ((*volatile p)()); p = (void ((*)()))ulckpwdf; return !p; }
/* end */

"x86_64-linux-gnu-gcc -o conftest -I/usr/include/x86_64-linux-gnu/ruby-3.0.0 -I/usr/include/ruby-3.0.0/ruby/backward -I/usr/include/ruby-3.0.0 -I. -Wdate-time -D_FORTIFY_SOURCE=2   -g -O2 -ffile-prefix-map=/build/ruby3.0-2KsnwC/ruby3.0-3.0.2=. -fstack-protector-strong -Wformat -Werror=format-security -fPIC conftest.c  -L. -L/usr/lib/x86_64-linux-gnu -L. -Wl,-z,relro -Wl,-z,now -fstack-protector-strong -rdynamic -Wl,-export-dynamic     -lruby-3.0  -lm   -lc"
checked program was:
/* begin */
 1: #include "ruby.h"
 2: 
 3: /*top*/
 4: extern int t(void);
 5: int main(int argc, char **argv)
 6: {
 7:   if (argc > 1000000) {
 8:     int (* volatile tp)(void)=(int (*)(void))&t;
 9:     printf("%d", (*tp)());
10:   }
11: 
12:   return !!argv[argc];
13: }
14: extern void ulckpwdf();
15: int t(void) { ulckpwdf(); return 0; }
/* end */

--------------------

have_func: checking for sgetspent()... -------------------- yes

"x86_64-linux-gnu-gcc -o conftest -I/usr/include/x86_64-linux-gnu/ruby-3.0.0 -I/usr/include/ruby-3.0.0/ruby/backward -I/usr/include/ruby-3.0.0 -I. -Wdate-time -D_FORTIFY_SOURCE=2   -g -O2 -ffile-prefix-map=/build/ruby3.0-2KsnwC/ruby3.0-3.0.2=. -fstack-protector-strong -Wformat -Werror=format-security -fPIC conftest.c  -L. -L/usr/lib/x86_64-linux-gnu -L. -Wl,-z,relro -Wl,-z,now -fstack-protector-strong -rdynamic -Wl,-export-dynamic     -lruby-3.0  -lm   -lc"
conftest.c: In function ‘t’:
conftest.c:14:57: error: ‘sgetspent’ undeclared (first use in this function)
   14 | int t(void) { void ((*volatile p)()); p = (void ((*)()))sgetspent; return !p; }
      |                                                         ^~~~~~~~~
conftest.c:14:57: note: each undeclared identifier is reported only once for each function it appears in
checked program was:
/* begin */
 1: #include "ruby.h"
 2: 
 3: /*top*/
 4: extern int t(void);
 5: int main(int argc, char **argv)
 6: {
 7:   if (argc > 1000000) {
 8:     int (* volatile tp)(void)=(int (*)(void))&t;
 9:     printf("%d", (*tp)());
10:   }
11: 
12:   return !!argv[argc];
13: }
14: int t(void) { void ((*volatile p)()); p = (void ((*)()))sgetspent; return !p; }
/* end */

"x86_64-linux-gnu-gcc -o conftest -I/usr/include/x86_64-linux-gnu/ruby-3.0.0 -I/usr/include/ruby-3.0.0/ruby/backward -I/usr/include/ruby-3.0.0 -I. -Wdate-time -D_FORTIFY_SOURCE=2   -g -O2 -ffile-prefix-map=/build/ruby3.0-2KsnwC/ruby3.0-3.0.2=. -fstack-protector-strong -Wformat -Werror=format-security -fPIC conftest.c  -L. -L/usr/lib/x86_64-linux-gnu -L. -Wl,-z,relro -Wl,-z,now -fstack-protector-strong -rdynamic -Wl,-export-dynamic     -lruby-3.0  -lm   -lc"
checked program was:
/* begin */
 1: #include "ruby.h"
 2: 
 3: /*top*/
 4: extern int t(void);
 5: int main(int argc, char **argv)
 6: {
 7:   if (argc > 1000000) {
 8:     int (* volatile tp)(void)=(int (*)(void))&t;
 9:     printf("%d", (*tp)());
10:   }
11: 
12:   return !!argv[argc];
13: }
14: extern void sgetspent();
15: int t(void) { sgetspent(); return 0; }
/* end */

--------------------

have_header: checking for ruby/io.h... -------------------- yes

"x86_64-linux-gnu-gcc -E -I/usr/include/x86_64-linux-gnu/ruby-3.0.0 -I/usr/include/ruby-3.0.0/ruby/backward -I/usr/include/ruby-3.0.0 -I. -Wdate-time -D_FORTIFY_SOURCE=2   -g -O2 -ffile-prefix-map=/build/ruby3.0-2KsnwC/ruby3.0-3.0.2=. -fstack-protector-strong -Wformat -Werror=format-security -fPIC  conftest.c -o conftest.i"
checked program was:
/* begin */
1: #include "ruby.h"
2: 
3: #include <ruby/io.h>
/* end */

--------------------

/usr/lib/ruby/vendor_ruby/rubygems/ext/builder.rb:92:in `run': make failed, exit code 2 (Gem::InstallError)
	from /usr/lib/ruby/vendor_ruby/rubygems/ext/builder.rb:43:in `block in make'
	from /usr/lib/ruby/vendor_ruby/rubygems/ext/builder.rb:35:in `each'
	from /usr/lib/ruby/vendor_ruby/rubygems/ext/builder.rb:35:in `make'
	from /usr/lib/ruby/vendor_ruby/rubygems/ext/ext_conf_builder.rb:63:in `block in build'
	from /usr/lib/ruby/3.0.0/tempfile.rb:317:in `open'
	from /usr/lib/ruby/vendor_ruby/rubygems/ext/ext_conf_builder.rb:26:in `build'
	from /usr/lib/ruby/vendor_ruby/gem2deb/extension_builder.rb:81:in `block in build_and_install'
	from /usr/lib/ruby/vendor_ruby/gem2deb/extension_builder.rb:71:in `chdir'
	from /usr/lib/ruby/vendor_ruby/gem2deb/extension_builder.rb:71:in `build_and_install'
	from /usr/lib/ruby/vendor_ruby/gem2deb/extension_builder.rb:115:in `block in build_all_extensions'
	from /usr/lib/ruby/vendor_ruby/gem2deb/extension_builder.rb:112:in `each'
	from /usr/lib/ruby/vendor_ruby/gem2deb/extension_builder.rb:112:in `build_all_extensions'
	from /usr/lib/ruby/vendor_ruby/gem2deb/extension_builder.rb:128:in `<main>'
~~~~~~~~~~~~~~~~~~~~~ ↑ mkmf.log ~~~~~~~~~~~~~~~~~~~~~
/usr/lib/ruby/vendor_ruby/gem2deb.rb:54:in `run': /usr/bin/ruby3.0 /usr/lib/ruby/vendor_ruby/gem2deb/extension_builder.rb /<<PKGBUILDDIR>> debian/ruby-shadow (Gem2Deb::CommandFailed)
	from /usr/lib/ruby/vendor_ruby/gem2deb.rb:65:in `run_ruby'
	from /usr/lib/ruby/vendor_ruby/gem2deb/installer.rb:54:in `block in install_files_and_build_extensions'
	from /usr/lib/ruby/vendor_ruby/gem2deb/installer.rb:51:in `each'
	from /usr/lib/ruby/vendor_ruby/gem2deb/installer.rb:51:in `install_files_and_build_extensions'
	from /usr/lib/ruby/vendor_ruby/gem2deb/installer.rb:28:in `install'
	from /usr/lib/ruby/vendor_ruby/gem2deb/dh_ruby.rb:86:in `block in install'
	from /usr/lib/ruby/vendor_ruby/gem2deb/dh_ruby.rb:84:in `each'
	from /usr/lib/ruby/vendor_ruby/gem2deb/dh_ruby.rb:84:in `install'
	from /usr/bin/dh_ruby:89:in `<main>'
dh_auto_install: error: dh_ruby --install /<<PKGBUILDDIR>>/debian/ruby-shadow returned exit code 1
make: *** [debian/rules:15: binary] Error 25
dpkg-buildpackage: error: fakeroot debian/rules binary subprocess returned exit status 2
--------------------------------------------------------------------------------
Build finished at 2021-10-05T00:55:59Z

Finished
--------


+------------------------------------------------------------------------------+
| Cleanup                                                                      |
+------------------------------------------------------------------------------+

Purging /<<BUILDDIR>>
Not cleaning session: cloned chroot in use
E: Build failure (dpkg-buildpackage died)

+------------------------------------------------------------------------------+
| Summary                                                                      |
+------------------------------------------------------------------------------+

Build Architecture: amd64
Build Type: binary
Build-Space: 292
Build-Time: 8
Distribution: experimental
Fail-Stage: build
Host Architecture: amd64
Install-Time: 11
Job: /home/admin/mass-rebuild/builds/3/ruby-shadow/ruby-shadow_2.5.0-1+rebuild1633395333.dsc
Machine Architecture: amd64
Package: ruby-shadow
Package-Time: 24
Source-Version: 2.5.0-1+rebuild1633395333
Space: 292
Status: attempted
Version: 2.5.0-1+rebuild1633395333
--------------------------------------------------------------------------------
Finished at 2021-10-05T00:55:59Z
Build needed 00:00:24, 292k disk space
