releasing package vim version 2:8.1.0875-5

Signed-off-by: James McCoy <jamessan@debian.org>
3 jobs for debian/sid in 30 minutes and 4 seconds (queued for 3 seconds)
Status Job ID Name Coverage
  Test
failed #197733
test:testing

00:20:59

passed #197734
test:ubuntu-devel

00:29:22

passed #197732
test:unstable

00:30:04

 
Name Stage Failure
failed
test:testing Test
TEST FAILURE
make[2]: *** [Makefile:54: report] Error 1
make[1]: *** [Makefile:2122: scripttests] Error 2
make: *** [debian/rules:252: build-vim-gtk3-stamp] Error 2
dpkg-buildpackage: error: debian/rules binary subprocess returned exit status 2
make[2]: Leaving directory '/builds/vim-team/deb-packages/vim/vim-8.1.0875/src/vim-gtk3/testdir'
make[1]: Leaving directory '/builds/vim-team/deb-packages/vim/vim-8.1.0875/src/vim-gtk3'
rm configure-vim-basic-stamp configure-vim-tiny-stamp configure-vim-gtk3-stamp configure-vim-gtk-stamp
ERROR: Job failed: exit code 1