Upgrading to GitLab 12.1.0.

Commit patch queue (exported by git-debrebase)

[git-debrebase make-patches: export and commit patches]
16 jobs for master in 14 minutes (queued for 2 seconds)
Status Job ID Name Coverage
  Build
failed #44136
centos-7-2-gcc

00:07:22

failed #44137
centos-7-2-gcc-debug

00:07:14

failed #44138
debian-jessie-clang

00:11:02

failed #44139
debian-jessie-clang-debug

00:10:39

failed #44140
debian-jessie-gcc

00:07:47

failed #44141
debian-jessie-gcc-debug

00:08:16

failed #44142
debian-stretch-clang

00:13:56

failed #44143
debian-stretch-clang-debug

00:13:42

failed #44144
debian-stretch-gcc

00:08:45

failed #44145
debian-stretch-gcc-debug

00:08:08

failed #44146
ubuntu-trusty-gcc

00:07:39

failed #44147
ubuntu-trusty-gcc-debug

00:07:11

failed #44148
ubuntu-xenial-clang

00:13:35

failed #44149
ubuntu-xenial-clang-debug

00:13:39

failed #44150
ubuntu-xenial-gcc

00:08:00

failed #44151
ubuntu-xenial-gcc-debug

00:07:46

 
Name Stage Failure
failed
debian-stretch-gcc-debug Build
make[1]: *** [install] Error 2
make[1]: Leaving directory '/builds/xen-team/debian-xen/tools'
Makefile:127: recipe for target 'install-tools' failed
make: *** [install-tools] Error 2
Uploading artifacts...
xen/.config: found 1 matching files
*.log: found 2 matching files
Uploading artifacts to coordinator... ok id=44145 responseStatus=201 Created token=koTR9r4C
ERROR: Job failed: exit code 1
failed
ubuntu-xenial-clang-debug Build
make[1]: *** [install] Error 2
make[1]: Leaving directory '/builds/xen-team/debian-xen/tools'
Makefile:127: recipe for target 'install-tools' failed
make: *** [install-tools] Error 2
Uploading artifacts...
xen/.config: found 1 matching files
*.log: found 2 matching files
Uploading artifacts to coordinator... ok id=44149 responseStatus=201 Created token=CoexerBp
ERROR: Job failed: exit code 1
failed
debian-jessie-gcc Build
make[1]: *** [install] Error 2
make[1]: Leaving directory '/builds/xen-team/debian-xen/tools'
Makefile:127: recipe for target 'install-tools' failed
make: *** [install-tools] Error 2
Uploading artifacts...
xen/.config: found 1 matching files
*.log: found 2 matching files
Uploading artifacts to coordinator... ok id=44140 responseStatus=201 Created token=Ro8LjGun
ERROR: Job failed: exit code 1
failed
ubuntu-xenial-clang Build
make[1]: *** [install] Error 2
make[1]: Leaving directory '/builds/xen-team/debian-xen/tools'
Makefile:127: recipe for target 'install-tools' failed
make: *** [install-tools] Error 2
Uploading artifacts...
xen/.config: found 1 matching files
*.log: found 2 matching files
Uploading artifacts to coordinator... ok id=44148 responseStatus=201 Created token=YBNnahK9
ERROR: Job failed: exit code 1
failed
ubuntu-xenial-gcc Build
make[1]: *** [install] Error 2
make[1]: Leaving directory '/builds/xen-team/debian-xen/tools'
Makefile:127: recipe for target 'install-tools' failed
make: *** [install-tools] Error 2
Uploading artifacts...
xen/.config: found 1 matching files
*.log: found 2 matching files
Uploading artifacts to coordinator... ok id=44150 responseStatus=201 Created token=oZoTsz8z
ERROR: Job failed: exit code 1
failed
ubuntu-xenial-gcc-debug Build
make[1]: *** [install] Error 2
make[1]: Leaving directory '/builds/xen-team/debian-xen/tools'
Makefile:127: recipe for target 'install-tools' failed
make: *** [install-tools] Error 2
Uploading artifacts...
xen/.config: found 1 matching files
*.log: found 2 matching files
Uploading artifacts to coordinator... ok id=44151 responseStatus=201 Created token=ngwfin8k
ERROR: Job failed: exit code 1
failed
debian-stretch-clang Build
make[1]: *** [install] Error 2
make[1]: Leaving directory '/builds/xen-team/debian-xen/tools'
Makefile:127: recipe for target 'install-tools' failed
make: *** [install-tools] Error 2
Uploading artifacts...
xen/.config: found 1 matching files
*.log: found 2 matching files
Uploading artifacts to coordinator... ok id=44142 responseStatus=201 Created token=W53sgngd
ERROR: Job failed: exit code 1
failed
ubuntu-trusty-gcc-debug Build
make[2]: Leaving directory `/builds/xen-team/debian-xen/tools'
make[1]: *** [install] Error 2
make[1]: Leaving directory `/builds/xen-team/debian-xen/tools'
make: *** [install-tools] Error 2
Uploading artifacts...
xen/.config: found 1 matching files
*.log: found 2 matching files
Uploading artifacts to coordinator... ok id=44147 responseStatus=201 Created token=krTx8jA7
ERROR: Job failed: exit code 1
failed
ubuntu-trusty-gcc Build
make[2]: Leaving directory `/builds/xen-team/debian-xen/tools'
make[1]: *** [install] Error 2
make[1]: Leaving directory `/builds/xen-team/debian-xen/tools'
make: *** [install-tools] Error 2
Uploading artifacts...
xen/.config: found 1 matching files
*.log: found 2 matching files
Uploading artifacts to coordinator... ok id=44146 responseStatus=201 Created token=NHDKm3KF
ERROR: Job failed: exit code 1
failed
debian-stretch-gcc Build
make[1]: *** [install] Error 2
make[1]: Leaving directory '/builds/xen-team/debian-xen/tools'
Makefile:127: recipe for target 'install-tools' failed
make: *** [install-tools] Error 2
Uploading artifacts...
xen/.config: found 1 matching files
*.log: found 2 matching files
Uploading artifacts to coordinator... ok id=44144 responseStatus=201 Created token=fmXBuWWs
ERROR: Job failed: exit code 1
failed
debian-stretch-clang-debug Build
make[1]: *** [install] Error 2
make[1]: Leaving directory '/builds/xen-team/debian-xen/tools'
Makefile:127: recipe for target 'install-tools' failed
make: *** [install-tools] Error 2
Uploading artifacts...
xen/.config: found 1 matching files
*.log: found 2 matching files
Uploading artifacts to coordinator... ok id=44143 responseStatus=201 Created token=QbWMEbsg
ERROR: Job failed: exit code 1
failed
centos-7-2-gcc-debug Build
make[2]: Leaving directory `/builds/xen-team/debian-xen/tools'
make[1]: *** [install] Error 2
make[1]: Leaving directory `/builds/xen-team/debian-xen/tools'
make: *** [install-tools] Error 2
Uploading artifacts...
xen/.config: found 1 matching files
*.log: found 2 matching files
Uploading artifacts to coordinator... ok id=44137 responseStatus=201 Created token=Pa9B_7Jy
ERROR: Job failed: exit code 1
failed
debian-jessie-clang Build
make[1]: *** [install] Error 2
make[1]: Leaving directory '/builds/xen-team/debian-xen/tools'
Makefile:127: recipe for target 'install-tools' failed
make: *** [install-tools] Error 2
Uploading artifacts...
xen/.config: found 1 matching files
*.log: found 2 matching files
Uploading artifacts to coordinator... ok id=44138 responseStatus=201 Created token=a6-3-2zt
ERROR: Job failed: exit code 1
failed
centos-7-2-gcc Build
make[2]: Leaving directory `/builds/xen-team/debian-xen/tools'
make[1]: *** [install] Error 2
make[1]: Leaving directory `/builds/xen-team/debian-xen/tools'
make: *** [install-tools] Error 2
Uploading artifacts...
xen/.config: found 1 matching files
*.log: found 2 matching files
Uploading artifacts to coordinator... ok id=44136 responseStatus=201 Created token=vSDAKvYK
ERROR: Job failed: exit code 1
failed
debian-jessie-clang-debug Build
make[1]: *** [install] Error 2
make[1]: Leaving directory '/builds/xen-team/debian-xen/tools'
Makefile:127: recipe for target 'install-tools' failed
make: *** [install-tools] Error 2
Uploading artifacts...
xen/.config: found 1 matching files
*.log: found 2 matching files
Uploading artifacts to coordinator... ok id=44139 responseStatus=201 Created token=ATbRySwB
ERROR: Job failed: exit code 1
failed
debian-jessie-gcc-debug Build
make[1]: *** [install] Error 2
make[1]: Leaving directory '/builds/xen-team/debian-xen/tools'
Makefile:127: recipe for target 'install-tools' failed
make: *** [install-tools] Error 2
Uploading artifacts...
xen/.config: found 1 matching files
*.log: found 2 matching files
Uploading artifacts to coordinator... ok id=44141 responseStatus=201 Created token=qAzcqea3
ERROR: Job failed: exit code 1